Difference between revisions of "com.aidinhut.simpletextcrypt/lastbuild 11"

From F-Droid
Jump to: navigation, search
(Build log)
(Build log)
Line 1: Line 1:
* build session started at 2020-10-23 13:31:34Z
+
* build session started at 2020-10-24 11:06:05Z
* this build started at 2020-10-23 20:28:33Z
+
* this build started at 2020-10-24 18:49:00Z
* this build completed at 2020-10-23 20:30:24Z
+
* this build completed at 2020-10-24 18:50:30Z
* fdroiddata: [https://gitlab.com/fdroid/fdroiddata/commit/4b50c716e8fe8d740ce2308fccdbc43ba268038b 4b50c716e8fe8d740ce2308fccdbc43ba268038b]
+
* fdroiddata: [https://gitlab.com/fdroid/fdroiddata/commit/9c302fad88588bb6a44c797d46716c6735287e5b 9c302fad88588bb6a44c797d46716c6735287e5b]
 
* fdroidserverid: [https://gitlab.com/fdroid/fdroidserver/commit/1f7228d53859f078698468b2e0bbe48485e4ece7 1f7228d53859f078698468b2e0bbe48485e4ece7]
 
* fdroidserverid: [https://gitlab.com/fdroid/fdroidserver/commit/1f7228d53859f078698468b2e0bbe48485e4ece7 1f7228d53859f078698468b2e0bbe48485e4ece7]
  
Line 18: Line 18:
 
== Installed Android Tools ==
 
== Installed Android Tools ==
  
2020-10-23 20:29:38,826 INFO: Creating log directory
+
2020-10-24 18:49:39,478 INFO: Creating log directory
2020-10-23 20:29:38,827 INFO: Creating temporary directory
+
2020-10-24 18:49:39,479 INFO: Creating temporary directory
2020-10-23 20:29:38,827 INFO: Creating output directory
+
2020-10-24 18:49:39,479 INFO: Creating output directory
2020-10-23 20:29:41,322 INFO: Using git version 2.11.0
+
2020-10-24 18:49:42,073 INFO: Using git version 2.11.0
2020-10-23 20:29:41,322 INFO: Building version 4.3 (11) of com.aidinhut.simpletextcrypt
+
2020-10-24 18:49:42,074 INFO: Building version 4.3 (11) of com.aidinhut.simpletextcrypt
2020-10-23 20:29:47,086 INFO: Getting source for revision v4.3
+
2020-10-24 18:49:47,774 INFO: Getting source for revision v4.3
2020-10-23 20:29:49,165 INFO: Creating local.properties file at build/com.aidinhut.simpletextcrypt/local.properties
+
2020-10-24 18:49:51,018 INFO: Creating local.properties file at build/com.aidinhut.simpletextcrypt/local.properties
2020-10-23 20:29:49,166 INFO: Creating local.properties file at build/com.aidinhut.simpletextcrypt/app/local.properties
+
2020-10-24 18:49:51,019 INFO: Creating local.properties file at build/com.aidinhut.simpletextcrypt/app/local.properties
2020-10-23 20:29:49,179 INFO: Cleaning Gradle project...
+
2020-10-24 18:49:51,033 INFO: Cleaning Gradle project...
2020-10-23 20:30:07,899 INFO: Scanning source for common problems...
+
2020-10-24 18:50:11,948 INFO: Scanning source for common problems...
2020-10-23 20:30:07,904 INFO: Removing gradle-wrapper.jar at gradle/wrapper/gradle-wrapper.jar
+
2020-10-24 18:50:11,953 INFO: Removing gradle-wrapper.jar at gradle/wrapper/gradle-wrapper.jar
2020-10-23 20:30:07,908 INFO: Creating source tarball...
+
2020-10-24 18:50:11,957 INFO: Creating source tarball...
2020-10-23 20:30:07,933 INFO: Building Gradle project...
+
2020-10-24 18:50:11,982 INFO: Building Gradle project...
2020-10-23 20:30:15,678 ERROR: Could not build app com.aidinhut.simpletextcrypt: Build failed for com.aidinhut.simpletextcrypt:4.3
+
2020-10-24 18:50:21,352 ERROR: Could not build app com.aidinhut.simpletextcrypt: Build failed for com.aidinhut.simpletextcrypt:4.3
 
==== detail begin ====
 
==== detail begin ====
 
Found 6.1.1 via distributionUrl
 
Found 6.1.1 via distributionUrl
Line 56: Line 56:
 
* Get more help at https://help.gradle.org
 
* Get more help at https://help.gradle.org
  
BUILD FAILED in 7s
+
BUILD FAILED in 8s
 
==== detail end ====
 
==== detail end ====
 
</pre>
 
</pre>

Revision as of 18:50, 24 October 2020

Installed Android Tools

Build Log

'Build.py failed on server for com.aidinhut.simpletextcrypt:4.3'

detail

== Installed Android Tools ==

2020-10-24 18:49:39,478 INFO: Creating log directory
2020-10-24 18:49:39,479 INFO: Creating temporary directory
2020-10-24 18:49:39,479 INFO: Creating output directory
2020-10-24 18:49:42,073 INFO: Using git version 2.11.0
2020-10-24 18:49:42,074 INFO: Building version 4.3 (11) of com.aidinhut.simpletextcrypt
2020-10-24 18:49:47,774 INFO: Getting source for revision v4.3
2020-10-24 18:49:51,018 INFO: Creating local.properties file at build/com.aidinhut.simpletextcrypt/local.properties
2020-10-24 18:49:51,019 INFO: Creating local.properties file at build/com.aidinhut.simpletextcrypt/app/local.properties
2020-10-24 18:49:51,033 INFO: Cleaning Gradle project...
2020-10-24 18:50:11,948 INFO: Scanning source for common problems...
2020-10-24 18:50:11,953 INFO: Removing gradle-wrapper.jar at gradle/wrapper/gradle-wrapper.jar
2020-10-24 18:50:11,957 INFO: Creating source tarball...
2020-10-24 18:50:11,982 INFO: Building Gradle project...
2020-10-24 18:50:21,352 ERROR: Could not build app com.aidinhut.simpletextcrypt: Build failed for com.aidinhut.simpletextcrypt:4.3
==== detail begin ====
Found 6.1.1 via distributionUrl
Running /opt/gradle/versions/6.1.1/bin/gradle assembleRelease
To honour the JVM settings for this build a new JVM will be forked. Please consider using the daemon: https://docs.gradle.org/6.1.1/userguide/gradle_daemon.html.
Daemon will be stopped at the end of the build stopping after processing

FAILURE: Build failed with an exception.

* What went wrong:
Could not determine the dependencies of task ':app:lintVitalRelease'.
> Could not resolve all task dependencies for configuration ':app:lintClassPath'.
   > Could not find org.jetbrains.trove4j:trove4j:20160824.
     Searched in the following locations:
       - https://repo.maven.apache.org/maven2/org/jetbrains/trove4j/trove4j/20160824/trove4j-20160824.pom
       - https://dl.google.com/dl/android/maven2/org/jetbrains/trove4j/trove4j/20160824/trove4j-20160824.pom
     Required by:
         project :app > com.android.tools.lint:lint-gradle:27.0.1 > com.android.tools:sdk-common:27.0.1
         project :app > com.android.tools.lint:lint-gradle:27.0.1 > com.android.tools.external.com-intellij:intellij-core:27.0.1

* Try:
Run with --stacktrace option to get the stack trace. Run with --info or --debug option to get more log output. Run with --scan to get full insights.

* Get more help at https://help.gradle.org

BUILD FAILED in 8s
==== detail end ====