Difference between revisions of "com.aidinhut.simpletextcrypt/lastbuild 11"

From F-Droid
Jump to: navigation, search
(Build log)
(Build log)
Line 1: Line 1:
* build session started at 2020-10-27 11:14:56Z
+
* build session started at 2020-10-28 07:00:12Z
* this build started at 2020-10-27 13:08:48Z
+
* this build started at 2020-10-28 14:15:04Z
* this build completed at 2020-10-27 13:08:57Z
+
* this build completed at 2020-10-28 14:17:59Z
* fdroiddata: [https://gitlab.com/fdroid/fdroiddata/commit/0ab5d3fda8e7f9c59b4db569c159d41ba34fed8c 0ab5d3fda8e7f9c59b4db569c159d41ba34fed8c]
+
* fdroiddata: [https://gitlab.com/fdroid/fdroiddata/commit/b2e64f56dd743efbd24bf72cf3d58663a88f2bd9 b2e64f56dd743efbd24bf72cf3d58663a88f2bd9]
 
* fdroidserverid: [https://gitlab.com/fdroid/fdroidserver/commit/1f7228d53859f078698468b2e0bbe48485e4ece7 1f7228d53859f078698468b2e0bbe48485e4ece7]
 
* fdroidserverid: [https://gitlab.com/fdroid/fdroidserver/commit/1f7228d53859f078698468b2e0bbe48485e4ece7 1f7228d53859f078698468b2e0bbe48485e4ece7]
 +
 +
* buildserverid: [https://gitlab.com/fdroid/fdroidserver/commit/06766ba48b079e2e8a13af15bf1cfbdb38365ca5 06766ba48b079e2e8a13af15bf1cfbdb38365ca5]
  
 
== Installed Android Tools ==
 
== Installed Android Tools ==
Line 11: Line 13:
 
== Build Log ==
 
== Build Log ==
  
"could not bring up vm 'builder_default'"
+
'Build.py failed on server for com.aidinhut.simpletextcrypt:4.3'
 +
=detail=
 +
<pre>
 +
== Installed Android Tools ==
 +
 
 +
2020-10-28 14:16:15,102 INFO: Creating log directory
 +
2020-10-28 14:16:15,102 INFO: Creating temporary directory
 +
2020-10-28 14:16:15,103 INFO: Creating output directory
 +
2020-10-28 14:16:17,728 INFO: Using git version 2.11.0
 +
2020-10-28 14:16:17,728 INFO: Building version 4.3 (11) of com.aidinhut.simpletextcrypt
 +
2020-10-28 14:16:23,179 INFO: Getting source for revision v4.3
 +
2020-10-28 14:16:25,552 INFO: Creating local.properties file at build/com.aidinhut.simpletextcrypt/local.properties
 +
2020-10-28 14:16:25,553 INFO: Creating local.properties file at build/com.aidinhut.simpletextcrypt/app/local.properties
 +
2020-10-28 14:16:25,568 INFO: Cleaning Gradle project...
 +
2020-10-28 14:16:49,904 INFO: Scanning source for common problems...
 +
2020-10-28 14:16:49,910 INFO: Removing gradle-wrapper.jar at gradle/wrapper/gradle-wrapper.jar
 +
2020-10-28 14:16:49,913 INFO: Creating source tarball...
 +
2020-10-28 14:16:49,938 INFO: Building Gradle project...
 +
2020-10-28 14:17:05,415 ERROR: Could not build app com.aidinhut.simpletextcrypt: Build failed for com.aidinhut.simpletextcrypt:4.3
 +
==== detail begin ====
 +
Found 6.1.1 via distributionUrl
 +
Running /opt/gradle/versions/6.1.1/bin/gradle assembleRelease
 +
To honour the JVM settings for this build a new JVM will be forked. Please consider using the daemon: https://docs.gradle.org/6.1.1/userguide/gradle_daemon.html.
 +
Daemon will be stopped at the end of the build stopping after processing
 +
File /home/vagrant/.android/repositories.cfg could not be loaded.
 +
Checking the license for package Android SDK Platform 30 in /home/vagrant/android-sdk/licenses
 +
License for package Android SDK Platform 30 accepted.
 +
Preparing "Install Android SDK Platform 30 (revision: 3)".
 +
"Install Android SDK Platform 30 (revision: 3)" ready.
 +
Installing Android SDK Platform 30 in /home/vagrant/android-sdk/platforms/android-30
 +
"Install Android SDK Platform 30 (revision: 3)" complete.
 +
"Install Android SDK Platform 30 (revision: 3)" finished.
 +
 
 +
FAILURE: Build failed with an exception.
 +
 
 +
* What went wrong:
 +
Could not determine the dependencies of task ':app:lintVitalRelease'.
 +
> Could not resolve all task dependencies for configuration ':app:lintClassPath'.
 +
  > Could not find org.jetbrains.trove4j:trove4j:20160824.
 +
    Searched in the following locations:
 +
      - https://repo.maven.apache.org/maven2/org/jetbrains/trove4j/trove4j/20160824/trove4j-20160824.pom
 +
      - https://dl.google.com/dl/android/maven2/org/jetbrains/trove4j/trove4j/20160824/trove4j-20160824.pom
 +
    Required by:
 +
        project :app > com.android.tools.lint:lint-gradle:27.0.1 > com.android.tools:sdk-common:27.0.1
 +
        project :app > com.android.tools.lint:lint-gradle:27.0.1 > com.android.tools.external.com-intellij:intellij-core:27.0.1
 +
 
 +
* Try:
 +
Run with --stacktrace option to get the stack trace. Run with --info or --debug option to get more log output. Run with --scan to get full insights.
 +
 
 +
* Get more help at https://help.gradle.org
 +
 
 +
BUILD FAILED in 14s
 +
==== detail end ====
 +
</pre>

Revision as of 14:18, 28 October 2020

Installed Android Tools

Build Log

'Build.py failed on server for com.aidinhut.simpletextcrypt:4.3'

detail

== Installed Android Tools ==

2020-10-28 14:16:15,102 INFO: Creating log directory
2020-10-28 14:16:15,102 INFO: Creating temporary directory
2020-10-28 14:16:15,103 INFO: Creating output directory
2020-10-28 14:16:17,728 INFO: Using git version 2.11.0
2020-10-28 14:16:17,728 INFO: Building version 4.3 (11) of com.aidinhut.simpletextcrypt
2020-10-28 14:16:23,179 INFO: Getting source for revision v4.3
2020-10-28 14:16:25,552 INFO: Creating local.properties file at build/com.aidinhut.simpletextcrypt/local.properties
2020-10-28 14:16:25,553 INFO: Creating local.properties file at build/com.aidinhut.simpletextcrypt/app/local.properties
2020-10-28 14:16:25,568 INFO: Cleaning Gradle project...
2020-10-28 14:16:49,904 INFO: Scanning source for common problems...
2020-10-28 14:16:49,910 INFO: Removing gradle-wrapper.jar at gradle/wrapper/gradle-wrapper.jar
2020-10-28 14:16:49,913 INFO: Creating source tarball...
2020-10-28 14:16:49,938 INFO: Building Gradle project...
2020-10-28 14:17:05,415 ERROR: Could not build app com.aidinhut.simpletextcrypt: Build failed for com.aidinhut.simpletextcrypt:4.3
==== detail begin ====
Found 6.1.1 via distributionUrl
Running /opt/gradle/versions/6.1.1/bin/gradle assembleRelease
To honour the JVM settings for this build a new JVM will be forked. Please consider using the daemon: https://docs.gradle.org/6.1.1/userguide/gradle_daemon.html.
Daemon will be stopped at the end of the build stopping after processing
File /home/vagrant/.android/repositories.cfg could not be loaded.
Checking the license for package Android SDK Platform 30 in /home/vagrant/android-sdk/licenses
License for package Android SDK Platform 30 accepted.
Preparing "Install Android SDK Platform 30 (revision: 3)".
"Install Android SDK Platform 30 (revision: 3)" ready.
Installing Android SDK Platform 30 in /home/vagrant/android-sdk/platforms/android-30
"Install Android SDK Platform 30 (revision: 3)" complete.
"Install Android SDK Platform 30 (revision: 3)" finished.

FAILURE: Build failed with an exception.

* What went wrong:
Could not determine the dependencies of task ':app:lintVitalRelease'.
> Could not resolve all task dependencies for configuration ':app:lintClassPath'.
   > Could not find org.jetbrains.trove4j:trove4j:20160824.
     Searched in the following locations:
       - https://repo.maven.apache.org/maven2/org/jetbrains/trove4j/trove4j/20160824/trove4j-20160824.pom
       - https://dl.google.com/dl/android/maven2/org/jetbrains/trove4j/trove4j/20160824/trove4j-20160824.pom
     Required by:
         project :app > com.android.tools.lint:lint-gradle:27.0.1 > com.android.tools:sdk-common:27.0.1
         project :app > com.android.tools.lint:lint-gradle:27.0.1 > com.android.tools.external.com-intellij:intellij-core:27.0.1

* Try:
Run with --stacktrace option to get the stack trace. Run with --info or --debug option to get more log output. Run with --scan to get full insights.

* Get more help at https://help.gradle.org

BUILD FAILED in 14s
==== detail end ====