Difference between revisions of "com.looker.droidify/lastbuild 34"

From F-Droid
Jump to: navigation, search
(Build log)
 
(Build log)
 
Line 1: Line 1:
* build session started at 2021-10-25 20:14:16Z
+
* build session started at 2021-10-26 23:45:28Z
* this build started at 2021-10-25 23:10:55Z
+
* this build started at 2021-10-27 04:08:29Z
* this build completed at 2021-10-25 23:16:55Z
+
* this build completed at 2021-10-27 04:14:34Z
* fdroiddata: [https://gitlab.com/fdroid/fdroiddata/commit/93e1180f99935466721378b1ec2b819e2fe6ce88 93e1180f99935466721378b1ec2b819e2fe6ce88]
+
* fdroiddata: [https://gitlab.com/fdroid/fdroiddata/commit/bcc3c45cea4d3b6830ec37dd6d0e288d1c848508 bcc3c45cea4d3b6830ec37dd6d0e288d1c848508]
 
* fdroidserverid: [https://gitlab.com/fdroid/fdroidserver/commit/bd079c9311737094e441e9a3e19f8841e9825b89 bd079c9311737094e441e9a3e19f8841e9825b89]
 
* fdroidserverid: [https://gitlab.com/fdroid/fdroidserver/commit/bd079c9311737094e441e9a3e19f8841e9825b89 bd079c9311737094e441e9a3e19f8841e9825b89]
  
Line 32: Line 32:
 
Get:3 http://deb.debian.org/debian stretch-backports/main amd64 openjdk-11-jre-headless amd64 11.0.6+10-1~bpo9+1 [37.4 MB]
 
Get:3 http://deb.debian.org/debian stretch-backports/main amd64 openjdk-11-jre-headless amd64 11.0.6+10-1~bpo9+1 [37.4 MB]
 
Get:4 http://deb.debian.org/debian stretch-backports/main amd64 openjdk-11-jdk-headless amd64 11.0.6+10-1~bpo9+1 [192 MB]
 
Get:4 http://deb.debian.org/debian stretch-backports/main amd64 openjdk-11-jdk-headless amd64 11.0.6+10-1~bpo9+1 [192 MB]
Fetched 230 MB in 3s (74.4 MB/s)
+
Fetched 230 MB in 2s (93.5 MB/s)
 
Selecting previously unselected package libasound2-data.
 
Selecting previously unselected package libasound2-data.
 
(Reading database ... 64914 files and directories currently installed.)
 
(Reading database ... 64914 files and directories currently installed.)
Line 60: Line 60:
 
+ update-alternatives --auto java
 
+ update-alternatives --auto java
 
update-alternatives: using /usr/lib/jvm/java-11-openjdk-amd64/bin/java to provide /usr/bin/java (java) in auto mode
 
update-alternatives: using /usr/lib/jvm/java-11-openjdk-amd64/bin/java to provide /usr/bin/java (java) in auto mode
2021-10-25 23:14:42,481 DEBUG: > sudo passwd --lock root
+
2021-10-27 04:12:22,618 DEBUG: > sudo passwd --lock root
 
passwd: password expiry information changed.
 
passwd: password expiry information changed.
2021-10-25 23:14:42,686 DEBUG: > sudo SUDO_FORCE_REMOVE=yes dpkg --purge sudo
+
2021-10-27 04:12:22,837 DEBUG: > sudo SUDO_FORCE_REMOVE=yes dpkg --purge sudo
 
(Reading database ... 65571 files and directories currently installed.)
 
(Reading database ... 65571 files and directories currently installed.)
 
Removing sudo (1.8.19p1-2.1+deb9u3) ...
 
Removing sudo (1.8.19p1-2.1+deb9u3) ...
 
Purging configuration files for sudo (1.8.19p1-2.1+deb9u3) ...
 
Purging configuration files for sudo (1.8.19p1-2.1+deb9u3) ...
 
Processing triggers for systemd (232-25+deb9u13) ...
 
Processing triggers for systemd (232-25+deb9u13) ...
2021-10-25 23:14:48,142 INFO: Getting source for revision 12f4cdde6cd58cfea1ebad15427ce7353e0d82d5
+
2021-10-27 04:12:28,099 INFO: Getting source for revision 12f4cdde6cd58cfea1ebad15427ce7353e0d82d5
2021-10-25 23:14:48,143 DEBUG: Directory: build/com.looker.droidify
+
2021-10-27 04:12:28,099 DEBUG: Directory: build/com.looker.droidify
2021-10-25 23:14:48,143 DEBUG: > git rev-parse --show-toplevel
+
2021-10-27 04:12:28,099 DEBUG: > git rev-parse --show-toplevel
2021-10-25 23:14:48,347 DEBUG: Directory: build/com.looker.droidify
+
2021-10-27 04:12:28,303 DEBUG: Directory: build/com.looker.droidify
2021-10-25 23:14:48,348 DEBUG: > git submodule foreach --recursive git reset --hard
+
2021-10-27 04:12:28,304 DEBUG: > git submodule foreach --recursive git reset --hard
2021-10-25 23:14:48,558 DEBUG: Directory: build/com.looker.droidify
+
2021-10-27 04:12:28,551 DEBUG: Directory: build/com.looker.droidify
2021-10-25 23:14:48,558 DEBUG: > git reset --hard
+
2021-10-27 04:12:28,551 DEBUG: > git reset --hard
2021-10-25 23:14:48,872 DEBUG: Directory: build/com.looker.droidify
+
2021-10-27 04:12:28,757 DEBUG: Directory: build/com.looker.droidify
2021-10-25 23:14:48,872 DEBUG: > git submodule foreach --recursive git clean -dffx
+
2021-10-27 04:12:28,757 DEBUG: > git submodule foreach --recursive git clean -dffx
2021-10-25 23:14:48,978 DEBUG: Directory: build/com.looker.droidify
+
2021-10-27 04:12:28,862 DEBUG: Directory: build/com.looker.droidify
2021-10-25 23:14:48,978 DEBUG: > git clean -dffx
+
2021-10-27 04:12:28,863 DEBUG: > git clean -dffx
2021-10-25 23:14:49,107 DEBUG: Directory: build/com.looker.droidify
+
2021-10-27 04:12:28,974 DEBUG: Directory: build/com.looker.droidify
2021-10-25 23:14:49,108 DEBUG: > git -c core.askpass=/bin/true -c core.sshCommand=/bin/false -c url.https://.insteadOf=ssh:// -c url.https://u:p@bitbucket.org/.insteadOf=git@bitbucket.org: -c url.https://u:p@bitbucket.org.insteadOf=git://bitbucket.org -c url.https://u:p@bitbucket.org.insteadOf=https://bitbucket.org -c url.https://u:p@github.com/.insteadOf=git@github.com: -c url.https://u:p@github.com.insteadOf=git://github.com -c url.https://u:p@github.com.insteadOf=https://github.com -c url.https://u:p@gitlab.com/.insteadOf=git@gitlab.com: -c url.https://u:p@gitlab.com.insteadOf=git://gitlab.com -c url.https://u:p@gitlab.com.insteadOf=https://gitlab.com fetch origin
+
2021-10-27 04:12:28,974 DEBUG: > git -c core.askpass=/bin/true -c core.sshCommand=/bin/false -c url.https://.insteadOf=ssh:// -c url.https://u:p@bitbucket.org/.insteadOf=git@bitbucket.org: -c url.https://u:p@bitbucket.org.insteadOf=git://bitbucket.org -c url.https://u:p@bitbucket.org.insteadOf=https://bitbucket.org -c url.https://u:p@github.com/.insteadOf=git@github.com: -c url.https://u:p@github.com.insteadOf=git://github.com -c url.https://u:p@github.com.insteadOf=https://github.com -c url.https://u:p@gitlab.com/.insteadOf=git@gitlab.com: -c url.https://u:p@gitlab.com.insteadOf=git://gitlab.com -c url.https://u:p@gitlab.com.insteadOf=https://gitlab.com fetch origin
2021-10-25 23:14:49,921 DEBUG: Directory: build/com.looker.droidify
+
2021-10-27 04:12:29,589 DEBUG: Directory: build/com.looker.droidify
2021-10-25 23:14:49,921 DEBUG: > git -c core.askpass=/bin/true -c core.sshCommand=/bin/false -c url.https://.insteadOf=ssh:// -c url.https://u:p@bitbucket.org/.insteadOf=git@bitbucket.org: -c url.https://u:p@bitbucket.org.insteadOf=git://bitbucket.org -c url.https://u:p@bitbucket.org.insteadOf=https://bitbucket.org -c url.https://u:p@github.com/.insteadOf=git@github.com: -c url.https://u:p@github.com.insteadOf=git://github.com -c url.https://u:p@github.com.insteadOf=https://github.com -c url.https://u:p@gitlab.com/.insteadOf=git@gitlab.com: -c url.https://u:p@gitlab.com.insteadOf=git://gitlab.com -c url.https://u:p@gitlab.com.insteadOf=https://gitlab.com fetch --prune --tags --force origin
+
2021-10-27 04:12:29,589 DEBUG: > git -c core.askpass=/bin/true -c core.sshCommand=/bin/false -c url.https://.insteadOf=ssh:// -c url.https://u:p@bitbucket.org/.insteadOf=git@bitbucket.org: -c url.https://u:p@bitbucket.org.insteadOf=git://bitbucket.org -c url.https://u:p@bitbucket.org.insteadOf=https://bitbucket.org -c url.https://u:p@github.com/.insteadOf=git@github.com: -c url.https://u:p@github.com.insteadOf=git://github.com -c url.https://u:p@github.com.insteadOf=https://github.com -c url.https://u:p@gitlab.com/.insteadOf=git@gitlab.com: -c url.https://u:p@gitlab.com.insteadOf=git://gitlab.com -c url.https://u:p@gitlab.com.insteadOf=https://gitlab.com fetch --prune --tags --force origin
2021-10-25 23:14:50,230 DEBUG: Directory: build/com.looker.droidify
+
2021-10-27 04:12:29,918 DEBUG: Directory: build/com.looker.droidify
2021-10-25 23:14:50,230 DEBUG: > git remote set-head origin --auto
+
2021-10-27 04:12:29,919 DEBUG: > git remote set-head origin --auto
2021-10-25 23:14:50,847 DEBUG: Directory: build/com.looker.droidify
+
2021-10-27 04:12:30,335 DEBUG: Directory: build/com.looker.droidify
2021-10-25 23:14:50,847 DEBUG: > git checkout -f 12f4cdde6cd58cfea1ebad15427ce7353e0d82d5
+
2021-10-27 04:12:30,336 DEBUG: > git checkout -f 12f4cdde6cd58cfea1ebad15427ce7353e0d82d5
2021-10-25 23:14:51,056 DEBUG: Directory: build/com.looker.droidify
+
2021-10-27 04:12:30,541 DEBUG: Directory: build/com.looker.droidify
2021-10-25 23:14:51,056 DEBUG: > git clean -dffx
+
2021-10-27 04:12:30,541 DEBUG: > git clean -dffx
2021-10-25 23:14:51,170 INFO: Creating local.properties file at build/com.looker.droidify/local.properties
+
2021-10-27 04:12:30,646 INFO: Creating local.properties file at build/com.looker.droidify/local.properties
2021-10-25 23:14:51,171 DEBUG: Removing debuggable flags from build/com.looker.droidify
+
2021-10-27 04:12:30,647 DEBUG: Removing debuggable flags from build/com.looker.droidify
2021-10-25 23:14:51,178 INFO: Cleaned build.gradle of keysigning configs at build/com.looker.droidify/build.gradle
+
2021-10-27 04:12:30,654 INFO: Cleaned build.gradle of keysigning configs at build/com.looker.droidify/build.gradle
2021-10-25 23:14:51,183 INFO: Cleaning Gradle project...
+
2021-10-27 04:12:30,659 INFO: Cleaning Gradle project...
2021-10-25 23:14:51,183 DEBUG: Directory: build/com.looker.droidify
+
2021-10-27 04:12:30,660 DEBUG: Directory: build/com.looker.droidify
2021-10-25 23:14:51,184 DEBUG: > /home/vagrant/fdroidserver/gradlew-fdroid clean
+
2021-10-27 04:12:30,660 DEBUG: > /home/vagrant/fdroidserver/gradlew-fdroid clean
 
Found 7.2 via distributionUrl
 
Found 7.2 via distributionUrl
 
Downloading missing gradle version 7.2
 
Downloading missing gradle version 7.2
Line 113: Line 113:
 
> Task :clean UP-TO-DATE
 
> Task :clean UP-TO-DATE
  
BUILD SUCCESSFUL in 27s
+
BUILD SUCCESSFUL in 26s
 
1 actionable task: 1 up-to-date
 
1 actionable task: 1 up-to-date
2021-10-25 23:15:21,975 INFO: Scanning source for common problems...
+
2021-10-27 04:13:00,055 INFO: Scanning source for common problems...
2021-10-25 23:15:21,985 INFO: Removing gradle-wrapper.jar at gradle/wrapper/gradle-wrapper.jar
+
2021-10-27 04:13:00,063 INFO: Removing gradle-wrapper.jar at gradle/wrapper/gradle-wrapper.jar
2021-10-25 23:15:21,992 INFO: Creating source tarball...
+
2021-10-27 04:13:00,071 INFO: Creating source tarball...
2021-10-25 23:15:22,150 INFO: Building Gradle project...
+
2021-10-27 04:13:00,229 INFO: Building Gradle project...
2021-10-25 23:15:22,150 DEBUG: Directory: build/com.looker.droidify
+
2021-10-27 04:13:00,229 DEBUG: Directory: build/com.looker.droidify
2021-10-25 23:15:22,150 DEBUG: > /home/vagrant/fdroidserver/gradlew-fdroid assembleRelease
+
2021-10-27 04:13:00,229 DEBUG: > /home/vagrant/fdroidserver/gradlew-fdroid assembleRelease
 
Found 7.2 via distributionUrl
 
Found 7.2 via distributionUrl
 
Running /opt/gradle/versions/7.2/bin/gradle assembleRelease
 
Running /opt/gradle/versions/7.2/bin/gradle assembleRelease
Line 159: Line 159:
 
> Task :extractReleaseNativeSymbolTables NO-SOURCE
 
> Task :extractReleaseNativeSymbolTables NO-SOURCE
 
> Task :mergeReleaseNativeDebugMetadata NO-SOURCE
 
> Task :mergeReleaseNativeDebugMetadata NO-SOURCE
> Task :mergeReleaseArtProfile
 
 
> Task :processReleaseJavaRes NO-SOURCE
 
> Task :processReleaseJavaRes NO-SOURCE
 +
> Task :mergeReleaseArtProfile
 
> Task :mergeReleaseShaders
 
> Task :mergeReleaseShaders
 +
> Task :processReleaseManifestForPackage
 +
> Task :checkReleaseDuplicateClasses
 
> Task :compileReleaseShaders NO-SOURCE
 
> Task :compileReleaseShaders NO-SOURCE
 
> Task :generateReleaseAssets UP-TO-DATE
 
> Task :generateReleaseAssets UP-TO-DATE
> Task :checkReleaseDuplicateClasses
 
 
> Task :mergeReleaseAssets
 
> Task :mergeReleaseAssets
 
> Task :compressReleaseAssets
 
> Task :compressReleaseAssets
Line 171: Line 172:
 
> Task :writeReleaseAppMetadata
 
> Task :writeReleaseAppMetadata
 
> Task :writeReleaseSigningConfigVersions
 
> Task :writeReleaseSigningConfigVersions
> Task :processReleaseManifestForPackage
 
 
> Task :processReleaseResources
 
> Task :processReleaseResources
 
> Task :kaptGenerateStubsReleaseKotlin
 
> Task :kaptGenerateStubsReleaseKotlin
Line 194: Line 194:
 
* Get more help at https://help.gradle.org
 
* Get more help at https://help.gradle.org
  
BUILD FAILED in 1m 20s
+
BUILD FAILED in 1m 21s
 
25 actionable tasks: 25 executed
 
25 actionable tasks: 25 executed
2021-10-25 23:16:43,333 DEBUG: Popen(['git', 'cat-file', '--batch-check'], cwd=/home/vagrant/build/com.looker.droidify, universal_newlines=False, shell=None)
+
2021-10-27 04:14:22,598 DEBUG: Popen(['git', 'cat-file', '--batch-check'], cwd=/home/vagrant/build/com.looker.droidify, universal_newlines=False, shell=None)
2021-10-25 23:16:43,339 ERROR: Could not build app com.looker.droidify: Build failed for com.looker.droidify:0.3.4@12f4cdde6cd58cfea1ebad15427ce7353e0d82d5
+
2021-10-27 04:14:22,603 ERROR: Could not build app com.looker.droidify: Build failed for com.looker.droidify:0.3.4@12f4cdde6cd58cfea1ebad15427ce7353e0d82d5
 
==== detail begin ====
 
==== detail begin ====
 
Found 7.2 via distributionUrl
 
Found 7.2 via distributionUrl
Line 237: Line 237:
 
> Task :extractReleaseNativeSymbolTables NO-SOURCE
 
> Task :extractReleaseNativeSymbolTables NO-SOURCE
 
> Task :mergeReleaseNativeDebugMetadata NO-SOURCE
 
> Task :mergeReleaseNativeDebugMetadata NO-SOURCE
> Task :mergeReleaseArtProfile
 
 
> Task :processReleaseJavaRes NO-SOURCE
 
> Task :processReleaseJavaRes NO-SOURCE
 +
> Task :mergeReleaseArtProfile
 
> Task :mergeReleaseShaders
 
> Task :mergeReleaseShaders
 +
> Task :processReleaseManifestForPackage
 +
> Task :checkReleaseDuplicateClasses
 
> Task :compileReleaseShaders NO-SOURCE
 
> Task :compileReleaseShaders NO-SOURCE
 
> Task :generateReleaseAssets UP-TO-DATE
 
> Task :generateReleaseAssets UP-TO-DATE
> Task :checkReleaseDuplicateClasses
 
 
> Task :mergeReleaseAssets
 
> Task :mergeReleaseAssets
 
> Task :compressReleaseAssets
 
> Task :compressReleaseAssets
Line 249: Line 250:
 
> Task :writeReleaseAppMetadata
 
> Task :writeReleaseAppMetadata
 
> Task :writeReleaseSigningConfigVersions
 
> Task :writeReleaseSigningConfigVersions
> Task :processReleaseManifestForPackage
 
 
> Task :processReleaseResources
 
> Task :processReleaseResources
 
> Task :kaptGenerateStubsReleaseKotlin
 
> Task :kaptGenerateStubsReleaseKotlin
Line 272: Line 272:
 
* Get more help at https://help.gradle.org
 
* Get more help at https://help.gradle.org
  
BUILD FAILED in 1m 20s
+
BUILD FAILED in 1m 21s
 
25 actionable tasks: 25 executed
 
25 actionable tasks: 25 executed
 
==== detail end ====
 
==== detail end ====
2021-10-25 23:16:43,340 DEBUG: Error encoutered, stopping by user request.
+
2021-10-27 04:14:22,603 DEBUG: Error encoutered, stopping by user request.
 
</pre>
 
</pre>

Latest revision as of 04:14, 27 October 2021

Installed Android Tools

Build Log

'Build.py failed on server for com.looker.droidify:0.3.4'

detail

[...]
ing additional packages will be installed:
  libasound2 libasound2-data openjdk-11-jre-headless
Suggested packages:
  libasound2-plugins alsa-utils openjdk-11-demo openjdk-11-source libnss-mdns
  fonts-dejavu-extra fonts-ipafont-gothic fonts-ipafont-mincho
  fonts-wqy-microhei | fonts-wqy-zenhei fonts-indic
The following NEW packages will be installed:
  libasound2 libasound2-data openjdk-11-jdk-headless openjdk-11-jre-headless
0 upgraded, 4 newly installed, 0 to remove and 2 not upgraded.
Need to get 230 MB of archives.
After this operation, 374 MB of additional disk space will be used.
Get:1 http://deb.debian.org/debian stretch/main amd64 libasound2-data all 1.1.3-5 [173 kB]
Get:2 http://deb.debian.org/debian stretch/main amd64 libasound2 amd64 1.1.3-5 [497 kB]
Get:3 http://deb.debian.org/debian stretch-backports/main amd64 openjdk-11-jre-headless amd64 11.0.6+10-1~bpo9+1 [37.4 MB]
Get:4 http://deb.debian.org/debian stretch-backports/main amd64 openjdk-11-jdk-headless amd64 11.0.6+10-1~bpo9+1 [192 MB]
Fetched 230 MB in 2s (93.5 MB/s)
Selecting previously unselected package libasound2-data.
(Reading database ... 64914 files and directories currently installed.)
Preparing to unpack .../libasound2-data_1.1.3-5_all.deb ...
Unpacking libasound2-data (1.1.3-5) ...
Selecting previously unselected package libasound2:amd64.
Preparing to unpack .../libasound2_1.1.3-5_amd64.deb ...
Unpacking libasound2:amd64 (1.1.3-5) ...
Selecting previously unselected package openjdk-11-jre-headless:amd64.
Preparing to unpack .../openjdk-11-jre-headless_11.0.6+10-1~bpo9+1_amd64.deb ...
Unpacking openjdk-11-jre-headless:amd64 (11.0.6+10-1~bpo9+1) ...
Selecting previously unselected package openjdk-11-jdk-headless:amd64.
Preparing to unpack .../openjdk-11-jdk-headless_11.0.6+10-1~bpo9+1_amd64.deb ...
Unpacking openjdk-11-jdk-headless:amd64 (11.0.6+10-1~bpo9+1) ...
Setting up libasound2-data (1.1.3-5) ...
Setting up libasound2:amd64 (1.1.3-5) ...
Processing triggers for libc-bin (2.24-11+deb9u4) ...
Setting up openjdk-11-jre-headless:amd64 (11.0.6+10-1~bpo9+1) ...
Setting up openjdk-11-jdk-headless:amd64 (11.0.6+10-1~bpo9+1) ...
update-alternatives: using /usr/lib/jvm/java-11-openjdk-amd64/bin/jdeprscan to provide /usr/bin/jdeprscan (jdeprscan) in auto mode
update-alternatives: using /usr/lib/jvm/java-11-openjdk-amd64/bin/jimage to provide /usr/bin/jimage (jimage) in auto mode
update-alternatives: using /usr/lib/jvm/java-11-openjdk-amd64/bin/jlink to provide /usr/bin/jlink (jlink) in auto mode
update-alternatives: using /usr/lib/jvm/java-11-openjdk-amd64/bin/jmod to provide /usr/bin/jmod (jmod) in auto mode
update-alternatives: using /usr/lib/jvm/java-11-openjdk-amd64/bin/jshell to provide /usr/bin/jshell (jshell) in auto mode
update-alternatives: using /usr/lib/jvm/java-11-openjdk-amd64/bin/jaotc to provide /usr/bin/jaotc (jaotc) in auto mode
update-alternatives: using /usr/lib/jvm/java-11-openjdk-amd64/bin/jhsdb to provide /usr/bin/jhsdb (jhsdb) in auto mode
+ update-alternatives --auto java
update-alternatives: using /usr/lib/jvm/java-11-openjdk-amd64/bin/java to provide /usr/bin/java (java) in auto mode
2021-10-27 04:12:22,618 DEBUG: > sudo passwd --lock root
passwd: password expiry information changed.
2021-10-27 04:12:22,837 DEBUG: > sudo SUDO_FORCE_REMOVE=yes dpkg --purge sudo
(Reading database ... 65571 files and directories currently installed.)
Removing sudo (1.8.19p1-2.1+deb9u3) ...
Purging configuration files for sudo (1.8.19p1-2.1+deb9u3) ...
Processing triggers for systemd (232-25+deb9u13) ...
2021-10-27 04:12:28,099 INFO: Getting source for revision 12f4cdde6cd58cfea1ebad15427ce7353e0d82d5
2021-10-27 04:12:28,099 DEBUG: Directory: build/com.looker.droidify
2021-10-27 04:12:28,099 DEBUG: > git rev-parse --show-toplevel
2021-10-27 04:12:28,303 DEBUG: Directory: build/com.looker.droidify
2021-10-27 04:12:28,304 DEBUG: > git submodule foreach --recursive git reset --hard
2021-10-27 04:12:28,551 DEBUG: Directory: build/com.looker.droidify
2021-10-27 04:12:28,551 DEBUG: > git reset --hard
2021-10-27 04:12:28,757 DEBUG: Directory: build/com.looker.droidify
2021-10-27 04:12:28,757 DEBUG: > git submodule foreach --recursive git clean -dffx
2021-10-27 04:12:28,862 DEBUG: Directory: build/com.looker.droidify
2021-10-27 04:12:28,863 DEBUG: > git clean -dffx
2021-10-27 04:12:28,974 DEBUG: Directory: build/com.looker.droidify
2021-10-27 04:12:28,974 DEBUG: > git -c core.askpass=/bin/true -c core.sshCommand=/bin/false -c url.https://.insteadOf=ssh:// -c url.https://u:p@bitbucket.org/.insteadOf=git@bitbucket.org: -c url.https://u:p@bitbucket.org.insteadOf=git://bitbucket.org -c url.https://u:p@bitbucket.org.insteadOf=https://bitbucket.org -c url.https://u:p@github.com/.insteadOf=git@github.com: -c url.https://u:p@github.com.insteadOf=git://github.com -c url.https://u:p@github.com.insteadOf=https://github.com -c url.https://u:p@gitlab.com/.insteadOf=git@gitlab.com: -c url.https://u:p@gitlab.com.insteadOf=git://gitlab.com -c url.https://u:p@gitlab.com.insteadOf=https://gitlab.com fetch origin
2021-10-27 04:12:29,589 DEBUG: Directory: build/com.looker.droidify
2021-10-27 04:12:29,589 DEBUG: > git -c core.askpass=/bin/true -c core.sshCommand=/bin/false -c url.https://.insteadOf=ssh:// -c url.https://u:p@bitbucket.org/.insteadOf=git@bitbucket.org: -c url.https://u:p@bitbucket.org.insteadOf=git://bitbucket.org -c url.https://u:p@bitbucket.org.insteadOf=https://bitbucket.org -c url.https://u:p@github.com/.insteadOf=git@github.com: -c url.https://u:p@github.com.insteadOf=git://github.com -c url.https://u:p@github.com.insteadOf=https://github.com -c url.https://u:p@gitlab.com/.insteadOf=git@gitlab.com: -c url.https://u:p@gitlab.com.insteadOf=git://gitlab.com -c url.https://u:p@gitlab.com.insteadOf=https://gitlab.com fetch --prune --tags --force origin
2021-10-27 04:12:29,918 DEBUG: Directory: build/com.looker.droidify
2021-10-27 04:12:29,919 DEBUG: > git remote set-head origin --auto
2021-10-27 04:12:30,335 DEBUG: Directory: build/com.looker.droidify
2021-10-27 04:12:30,336 DEBUG: > git checkout -f 12f4cdde6cd58cfea1ebad15427ce7353e0d82d5
2021-10-27 04:12:30,541 DEBUG: Directory: build/com.looker.droidify
2021-10-27 04:12:30,541 DEBUG: > git clean -dffx
2021-10-27 04:12:30,646 INFO: Creating local.properties file at build/com.looker.droidify/local.properties
2021-10-27 04:12:30,647 DEBUG: Removing debuggable flags from build/com.looker.droidify
2021-10-27 04:12:30,654 INFO: Cleaned build.gradle of keysigning configs at build/com.looker.droidify/build.gradle
2021-10-27 04:12:30,659 INFO: Cleaning Gradle project...
2021-10-27 04:12:30,660 DEBUG: Directory: build/com.looker.droidify
2021-10-27 04:12:30,660 DEBUG: > /home/vagrant/fdroidserver/gradlew-fdroid clean
Found 7.2 via distributionUrl
Downloading missing gradle version 7.2
cachedir /home/vagrant/.cache/fdroidserver
/home/vagrant/.cache/fdroidserver/gradle-7.2-bin.zip: OK
Running /opt/gradle/versions/7.2/bin/gradle clean

Welcome to Gradle 7.2!

Here are the highlights of this release:
 - Toolchain support for Scala
 - More cache hits when Java source files have platform-specific line endings
 - More resilient remote HTTP build cache behavior

For more details see https://docs.gradle.org/7.2/release-notes.html

To honour the JVM settings for this build a single-use Daemon process will be forked. See https://docs.gradle.org/7.2/userguide/gradle_daemon.html#sec:disabling_the_daemon.
Daemon will be stopped at the end of the build 
> Task :clean UP-TO-DATE

BUILD SUCCESSFUL in 26s
1 actionable task: 1 up-to-date
2021-10-27 04:13:00,055 INFO: Scanning source for common problems...
2021-10-27 04:13:00,063 INFO: Removing gradle-wrapper.jar at gradle/wrapper/gradle-wrapper.jar
2021-10-27 04:13:00,071 INFO: Creating source tarball...
2021-10-27 04:13:00,229 INFO: Building Gradle project...
2021-10-27 04:13:00,229 DEBUG: Directory: build/com.looker.droidify
2021-10-27 04:13:00,229 DEBUG: > /home/vagrant/fdroidserver/gradlew-fdroid assembleRelease
Found 7.2 via distributionUrl
Running /opt/gradle/versions/7.2/bin/gradle assembleRelease
To honour the JVM settings for this build a single-use Daemon process will be forked. See https://docs.gradle.org/7.2/userguide/gradle_daemon.html#sec:disabling_the_daemon.
Daemon will be stopped at the end of the build 
Checking the license for package Android SDK Build-Tools 30.0.2 in /opt/android-sdk/licenses
License for package Android SDK Build-Tools 30.0.2 accepted.
Preparing "Install Android SDK Build-Tools 30.0.2 (revision: 30.0.2)".
"Install Android SDK Build-Tools 30.0.2 (revision: 30.0.2)" ready.
Installing Android SDK Build-Tools 30.0.2 in /opt/android-sdk/build-tools/30.0.2
"Install Android SDK Build-Tools 30.0.2 (revision: 30.0.2)" complete.
"Install Android SDK Build-Tools 30.0.2 (revision: 30.0.2)" finished.
Checking the license for package Android SDK Platform 31 in /opt/android-sdk/licenses
License for package Android SDK Platform 31 accepted.
Preparing "Install Android SDK Platform 31 (revision: 1)".
"Install Android SDK Platform 31 (revision: 1)" ready.
Installing Android SDK Platform 31 in /opt/android-sdk/platforms/android-31
"Install Android SDK Platform 31 (revision: 1)" complete.
"Install Android SDK Platform 31 (revision: 1)" finished.
> Task :preBuild UP-TO-DATE
> Task :preReleaseBuild UP-TO-DATE
> Task :compileReleaseAidl NO-SOURCE
> Task :compileReleaseRenderscript NO-SOURCE
> Task :generateReleaseBuildConfig
> Task :generateReleaseResValues
> Task :generateReleaseResources
> Task :checkReleaseAarMetadata
> Task :createReleaseCompatibleScreenManifests
> Task :extractDeepLinksRelease
> Task :processReleaseMainManifest
> Task :processReleaseManifest
> Task :mergeReleaseResources
> Task :extractProguardFiles
> Task :javaPreCompileRelease
> Task :mergeReleaseJniLibFolders
> Task :mergeReleaseNativeLibs NO-SOURCE
> Task :stripReleaseDebugSymbols NO-SOURCE
> Task :extractReleaseNativeSymbolTables NO-SOURCE
> Task :mergeReleaseNativeDebugMetadata NO-SOURCE
> Task :processReleaseJavaRes NO-SOURCE
> Task :mergeReleaseArtProfile
> Task :mergeReleaseShaders
> Task :processReleaseManifestForPackage
> Task :checkReleaseDuplicateClasses
> Task :compileReleaseShaders NO-SOURCE
> Task :generateReleaseAssets UP-TO-DATE
> Task :mergeReleaseAssets
> Task :compressReleaseAssets
> Task :collectReleaseDependencies
> Task :sdkReleaseDependencyData
> Task :writeReleaseAppMetadata
> Task :writeReleaseSigningConfigVersions
> Task :processReleaseResources
> Task :kaptGenerateStubsReleaseKotlin

> Task :kaptReleaseKotlin
/home/vagrant/build/com.looker.droidify/build/tmp/kapt3/stubs/release/com/looker/droidify/database/DatabaseX.java:8: warning: Schema export directory is not provided to the annotation processor so we cannot export the schema. You can either provide `room.schemaLocation` annotation processor argument OR set exportSchema to false.
public abstract class DatabaseX extends androidx.room.RoomDatabase {
                ^

> Task :compileReleaseKotlin FAILED
e: /home/vagrant/build/com.looker.droidify/src/main/kotlin/com/looker/droidify/screen/SettingsFragment.kt: (35, 41): Type mismatch: inferred type is android.widget.Toolbar but androidx.appcompat.widget.Toolbar was expected

FAILURE: Build failed with an exception.

* What went wrong:
Execution failed for task ':compileReleaseKotlin'.
> Compilation error. See log for more details

* Try:
Run with --stacktrace option to get the stack trace. Run with --info or --debug option to get more log output. Run with --scan to get full insights.

* Get more help at https://help.gradle.org

BUILD FAILED in 1m 21s
25 actionable tasks: 25 executed
2021-10-27 04:14:22,598 DEBUG: Popen(['git', 'cat-file', '--batch-check'], cwd=/home/vagrant/build/com.looker.droidify, universal_newlines=False, shell=None)
2021-10-27 04:14:22,603 ERROR: Could not build app com.looker.droidify: Build failed for com.looker.droidify:0.3.4@12f4cdde6cd58cfea1ebad15427ce7353e0d82d5
==== detail begin ====
Found 7.2 via distributionUrl
Running /opt/gradle/versions/7.2/bin/gradle assembleRelease
To honour the JVM settings for this build a single-use Daemon process will be forked. See https://docs.gradle.org/7.2/userguide/gradle_daemon.html#sec:disabling_the_daemon.
Daemon will be stopped at the end of the build 
Checking the license for package Android SDK Build-Tools 30.0.2 in /opt/android-sdk/licenses
License for package Android SDK Build-Tools 30.0.2 accepted.
Preparing "Install Android SDK Build-Tools 30.0.2 (revision: 30.0.2)".
"Install Android SDK Build-Tools 30.0.2 (revision: 30.0.2)" ready.
Installing Android SDK Build-Tools 30.0.2 in /opt/android-sdk/build-tools/30.0.2
"Install Android SDK Build-Tools 30.0.2 (revision: 30.0.2)" complete.
"Install Android SDK Build-Tools 30.0.2 (revision: 30.0.2)" finished.
Checking the license for package Android SDK Platform 31 in /opt/android-sdk/licenses
License for package Android SDK Platform 31 accepted.
Preparing "Install Android SDK Platform 31 (revision: 1)".
"Install Android SDK Platform 31 (revision: 1)" ready.
Installing Android SDK Platform 31 in /opt/android-sdk/platforms/android-31
"Install Android SDK Platform 31 (revision: 1)" complete.
"Install Android SDK Platform 31 (revision: 1)" finished.
> Task :preBuild UP-TO-DATE
> Task :preReleaseBuild UP-TO-DATE
> Task :compileReleaseAidl NO-SOURCE
> Task :compileReleaseRenderscript NO-SOURCE
> Task :generateReleaseBuildConfig
> Task :generateReleaseResValues
> Task :generateReleaseResources
> Task :checkReleaseAarMetadata
> Task :createReleaseCompatibleScreenManifests
> Task :extractDeepLinksRelease
> Task :processReleaseMainManifest
> Task :processReleaseManifest
> Task :mergeReleaseResources
> Task :extractProguardFiles
> Task :javaPreCompileRelease
> Task :mergeReleaseJniLibFolders
> Task :mergeReleaseNativeLibs NO-SOURCE
> Task :stripReleaseDebugSymbols NO-SOURCE
> Task :extractReleaseNativeSymbolTables NO-SOURCE
> Task :mergeReleaseNativeDebugMetadata NO-SOURCE
> Task :processReleaseJavaRes NO-SOURCE
> Task :mergeReleaseArtProfile
> Task :mergeReleaseShaders
> Task :processReleaseManifestForPackage
> Task :checkReleaseDuplicateClasses
> Task :compileReleaseShaders NO-SOURCE
> Task :generateReleaseAssets UP-TO-DATE
> Task :mergeReleaseAssets
> Task :compressReleaseAssets
> Task :collectReleaseDependencies
> Task :sdkReleaseDependencyData
> Task :writeReleaseAppMetadata
> Task :writeReleaseSigningConfigVersions
> Task :processReleaseResources
> Task :kaptGenerateStubsReleaseKotlin

> Task :kaptReleaseKotlin
/home/vagrant/build/com.looker.droidify/build/tmp/kapt3/stubs/release/com/looker/droidify/database/DatabaseX.java:8: warning: Schema export directory is not provided to the annotation processor so we cannot export the schema. You can either provide `room.schemaLocation` annotation processor argument OR set exportSchema to false.
public abstract class DatabaseX extends androidx.room.RoomDatabase {
                ^

> Task :compileReleaseKotlin FAILED
e: /home/vagrant/build/com.looker.droidify/src/main/kotlin/com/looker/droidify/screen/SettingsFragment.kt: (35, 41): Type mismatch: inferred type is android.widget.Toolbar but androidx.appcompat.widget.Toolbar was expected

FAILURE: Build failed with an exception.

* What went wrong:
Execution failed for task ':compileReleaseKotlin'.
> Compilation error. See log for more details

* Try:
Run with --stacktrace option to get the stack trace. Run with --info or --debug option to get more log output. Run with --scan to get full insights.

* Get more help at https://help.gradle.org

BUILD FAILED in 1m 21s
25 actionable tasks: 25 executed
==== detail end ====
2021-10-27 04:14:22,603 DEBUG: Error encoutered, stopping by user request.