com.nextcloud.android.beta/lastbuild 20190510

From F-Droid
Jump to: navigation, search

Installed Android Tools

Build Log

'Build.py failed on server for com.nextcloud.android.beta:20190510'

detail

== Installed Android Tools ==

INFO: Creating log directory
INFO: Creating temporary directory
INFO: Creating output directory
INFO: Using git version 2.11.0
INFO: Building version 20190510 (20190510) of com.nextcloud.android.beta
INFO: Getting source for revision dev-20190510
INFO: Initialising submodules
INFO: Creating local.properties file at build/com.nextcloud.android.beta/local.properties
INFO: Removing specified files
INFO: Removing user_manual
INFO: Removing gplay.gradle
INFO: Cleaning Gradle project...
INFO: Scanning source for common problems...
INFO: Removing gradle-wrapper.jar at gradle/wrapper/gradle-wrapper.jar
INFO: Removing binary at src/androidTest/assets/srEPevoPqPZpPEaeDnS3
INFO: Removing binary at src/androidTest/assets/n9WXAIXO2wRY4R8nXwmo
INFO: Removing binary at src/androidTest/assets/encrypted/n9WXAIXO2wRY4R8nXwmo
INFO: Removing binary at src/androidTest/assets/encrypted/ia7OEEEyXMoRa1QWQk8r
INFO: Creating source tarball...
INFO: Building Gradle project...
ERROR: Could not build app com.nextcloud.android.beta: Build failed for com.nextcloud.android.beta:20190510
==== detail begin ====
Found 5.1.1 via distributionUrl
Running /opt/gradle/versions/5.1.1/bin/gradle assembleVersionDevRelease
> Task :preBuild UP-TO-DATE
> Task :preVersionDevReleaseBuild
> Task :compileVersionDevReleaseAidl
> Task :compileVersionDevReleaseRenderscript NO-SOURCE
> Task :checkVersionDevReleaseManifest
> Task :generateVersionDevReleaseBuildConfig
> Task :mainApkListPersistenceVersionDevRelease
> Task :generateVersionDevReleaseResValues
> Task :generateVersionDevReleaseResources
> Task :mergeVersionDevReleaseResources
> Task :createVersionDevReleaseCompatibleScreenManifests
> Task :processVersionDevReleaseManifest
/home/vagrant/build/com.nextcloud.android.beta/src/main/res/layout/preference_widget_radiobutton.xml:15: warn: generated id 'android:id/checkbox' for external package 'android'.
warn: removing resource com.nextcloud.android.beta:string/auth_connecting_auth_server without required default value.
warn: removing resource com.nextcloud.android.beta:string/auth_expired_oauth_token_toast without required default value.
warn: removing resource com.nextcloud.android.beta:string/auth_expired_saml_sso_token_toast without required default value.
warn: removing resource com.nextcloud.android.beta:string/auth_getting_authorization without required default value.
warn: removing resource com.nextcloud.android.beta:string/oauth_2_0_access_end_point_address_hint without required default value.
warn: removing resource com.nextcloud.android.beta:string/oauth_2_0_auth_end_point_address_hint without required default value.
warn: removing resource com.nextcloud.android.beta:string/oauth_check_onoff without required default value.
warn: removing resource com.nextcloud.android.beta:string/oauth_login_connection without required default value.
warn: removing resource com.nextcloud.android.beta:string/whats_new_device_credentials_content without required default value.
warn: removing resource com.nextcloud.android.beta:string/whats_new_device_credentials_title without required default value.

> Task :processVersionDevReleaseResources
> Task :compileVersionDevReleaseKotlin
> Task :prepareLintJar
> Task :generateVersionDevReleaseSources
> Task :javaPreCompileVersionDevRelease

> Task :compileVersionDevReleaseJavaWithJavac
Gradle may disable incremental compilation as the following annotation processors are not incremental: butterknife-compiler-10.1.0.jar (com.jakewharton:butterknife-compiler:10.1.0).
Consider setting the experimental feature flag android.enableSeparateAnnotationProcessing=true in the gradle.properties file to run annotation processing in a separate task and make compilation incremental.
/home/vagrant/build/com.nextcloud.android.beta/src/main/java/com/owncloud/android/operations/UploadFileOperation.java:590: error: constructor ChunkedFileUploadRemoteOperation in class ChunkedFileUploadRemoteOperation cannot be applied to given types;
                mUploadOperation = new ChunkedFileUploadRemoteOperation(encryptedTempFile.getAbsolutePath(),
                                   ^
  required: String,String,String,String,String,boolean
  found: String,String,String,String,String,String,boolean
  reason: actual and formal argument lists differ in length
/home/vagrant/build/com.nextcloud.android.beta/src/main/java/com/owncloud/android/operations/UploadFileOperation.java:839: error: constructor ChunkedFileUploadRemoteOperation in class ChunkedFileUploadRemoteOperation cannot be applied to given types;
                mUploadOperation = new ChunkedFileUploadRemoteOperation(mFile.getStoragePath(),
                                   ^
  required: String,String,String,String,String,boolean
  found: String,String,String,String,String,String,boolean
  reason: actual and formal argument lists differ in length
/home/vagrant/build/com.nextcloud.android.beta/src/main/java/com/owncloud/android/services/OperationsService.java:705: error: constructor RestoreFileVersionRemoteOperation in class RestoreFileVersionRemoteOperation cannot be applied to given types;
                        operation = new RestoreFileVersionRemoteOperation(fileVersion.getRemoteId(),
                                    ^
  required: String,String
  found: String,String,String
  reason: actual and formal argument lists differ in length
/home/vagrant/build/com.nextcloud.android.beta/src/main/java/com/owncloud/android/ui/activity/DrawerActivity.java:993: error: constructor GetRemoteUserInfoOperation in class GetRemoteUserInfoOperation cannot be applied to given types;
                    getQuotaInfoOperation = new GetRemoteUserInfoOperation(userId);
                                            ^
  required: no arguments
  found: String
  reason: actual and formal argument lists differ in length
/home/vagrant/build/com.nextcloud.android.beta/src/main/java/com/owncloud/android/operations/CommentFileOperation.java:59: error: constructor CommentFileRemoteOperation in class CommentFileRemoteOperation cannot be applied to given types;
        RemoteOperationResult result = new CommentFileRemoteOperation(message, fileId, userId).execute(client);
                                       ^
  required: String,String
  found: String,String,String
  reason: actual and formal argument lists differ in length
/home/vagrant/build/com.nextcloud.android.beta/src/main/java/com/owncloud/android/ui/fragment/OCFileListFragment.java:1455: error: constructor ToggleFavoriteRemoteOperation in class ToggleFavoriteRemoteOperation cannot be applied to given types;
            ToggleFavoriteRemoteOperation toggleFavoriteOperation = new ToggleFavoriteRemoteOperation(
                                                                    ^
  required: boolean,String
  found: boolean,String,String
  reason: actual and formal argument lists differ in length
/home/vagrant/build/com.nextcloud.android.beta/src/main/java/com/owncloud/android/ui/fragment/OCFileListFragment.java:1529: error: constructor SearchRemoteOperation in class SearchRemoteOperation cannot be applied to given types;
            remoteOperation = new SearchRemoteOperation(event.getSearchQuery(), event.getSearchType(),
                              ^
  required: String,SearchType,boolean
  found: String,SearchType,boolean,String
  reason: actual and formal argument lists differ in length
/home/vagrant/build/com.nextcloud.android.beta/src/main/java/com/owncloud/android/ui/fragment/FileDetailActivitiesFragment.java:331: error: constructor ReadFileVersionsRemoteOperation in class ReadFileVersionsRemoteOperation cannot be applied to given types;
                    ReadFileVersionsRemoteOperation readFileVersionsOperation = new ReadFileVersionsRemoteOperation(
                                                                                ^
  required: String
  found: String,String
  reason: actual and formal argument lists differ in length
/home/vagrant/build/com.nextcloud.android.beta/src/main/java/com/owncloud/android/ui/asynctasks/FetchRemoteFileTask.java:67: error: constructor SearchRemoteOperation in class SearchRemoteOperation cannot be applied to given types;
        SearchRemoteOperation searchRemoteOperation = new SearchRemoteOperation(fileId,
                                                      ^
  required: String,SearchType,boolean
  found: String,SearchType,boolean,String
  reason: actual and formal argument lists differ in length
/home/vagrant/build/com.nextcloud.android.beta/src/main/java/com/owncloud/android/ui/trashbin/RemoteTrashbinRepository.java:119: error: constructor EmptyTrashbinRemoteOperation in class EmptyTrashbinRemoteOperation cannot be applied to given types;
            EmptyTrashbinRemoteOperation emptyTrashbinFileOperation = new EmptyTrashbinRemoteOperation(userId);
                                                                      ^
  required: no arguments
  found: String
  reason: actual and formal argument lists differ in length
/home/vagrant/build/com.nextcloud.android.beta/src/main/java/com/owncloud/android/ui/trashbin/RemoteTrashbinRepository.java:155: error: constructor RestoreTrashbinFileRemoteOperation in class RestoreTrashbinFileRemoteOperation cannot be applied to given types;
            RemoteOperationResult result = new RestoreTrashbinFileRemoteOperation(
                                           ^
  required: String,String
  found: String,String,String
  reason: actual and formal argument lists differ in length
/home/vagrant/build/com.nextcloud.android.beta/src/main/java/com/owncloud/android/ui/trashbin/RemoteTrashbinRepository.java:192: error: constructor ReadTrashbinFolderRemoteOperation in class ReadTrashbinFolderRemoteOperation cannot be applied to given types;
            RemoteOperationResult result = new ReadTrashbinFolderRemoteOperation(remotePath, userId).execute(client);
                                           ^
  required: String
  found: String,String
  reason: actual and formal argument lists differ in length
/home/vagrant/build/com.nextcloud.android.beta/src/main/java/com/owncloud/android/ui/dialog/SetupEncryptionDialogFragment.java:268: error: constructor GetPublicKeyOperation in class GetPublicKeyOperation cannot be applied to given types;
            GetPublicKeyOperation publicKeyOperation = new GetPublicKeyOperation(userID);
                                                       ^
  required: no arguments
  found: String
  reason: actual and formal argument lists differ in length
/home/vagrant/build/com.nextcloud.android.beta/src/main/java/com/owncloud/android/MainApp.java:207: error: cannot find symbol
        OwnCloudClientManagerFactory.setNextcloudUserAgent(getNextcloudUserAgent());
                                    ^
  symbol:   method setNextcloudUserAgent(String)
  location: class OwnCloudClientManagerFactory
Note: Some input files use or override a deprecated API.
Note: Recompile with -Xlint:deprecation for details.
Note: Some input files use unchecked or unsafe operations.
Note: Recompile with -Xlint:unchecked for details.
14 errors

> Task :compileVersionDevReleaseJavaWithJavac FAILED

FAILURE: Build failed with an exception.

* What went wrong:
Execution failed for task ':compileVersionDevReleaseJavaWithJavac'.
> Compilation failed; see the compiler error output for details.

* Try:
Run with --stacktrace option to get the stack trace. Run with --info or --debug option to get more log output. Run with --scan to get full insights.

* Get more help at https://help.gradle.org

Deprecated Gradle features were used in this build, making it incompatible with Gradle 6.0.
Use '--warning-mode all' to show the individual deprecation warnings.
See https://docs.gradle.org/5.1.1/userguide/command_line_interface.html#sec:command_line_warnings

BUILD FAILED in 2m 39s
14 actionable tasks: 14 executed
==== detail end ====