com.nextcloud.android.beta/lastbuild 20190613

From F-Droid
Revision as of 09:33, 15 June 2019 by Robot (Talk | contribs) (Build log)

(diff) ← Older revision | Latest revision (diff) | Newer revision → (diff)
Jump to: navigation, search

Installed Android Tools

Build Log

'Build.py failed on server for com.nextcloud.android.beta:20190613'

detail

== Installed Android Tools ==

INFO: Creating log directory
INFO: Creating temporary directory
INFO: Creating output directory
INFO: Using git version 2.11.0
INFO: Building version 20190613 (20190613) of com.nextcloud.android.beta
INFO: Getting source for revision dev-20190613
INFO: Initialising submodules
INFO: Creating local.properties file at build/com.nextcloud.android.beta/local.properties
INFO: Removing specified files
INFO: Removing gplay.gradle
INFO: Removing user_manual
INFO: Cleaning Gradle project...
INFO: Scanning source for common problems...
INFO: Removing gradle-wrapper.jar at gradle/wrapper/gradle-wrapper.jar
INFO: Removing binary at src/androidTest/assets/srEPevoPqPZpPEaeDnS3
INFO: Removing binary at src/androidTest/assets/n9WXAIXO2wRY4R8nXwmo
INFO: Removing binary at src/androidTest/assets/encrypted/n9WXAIXO2wRY4R8nXwmo
INFO: Removing binary at src/androidTest/assets/encrypted/ia7OEEEyXMoRa1QWQk8r
INFO: Creating source tarball...
INFO: Building Gradle project...
ERROR: Could not build app com.nextcloud.android.beta: Build failed for com.nextcloud.android.beta:20190613
==== detail begin ====
Found 5.1.1 via distributionUrl
Running /opt/gradle/versions/5.1.1/bin/gradle assembleVersionDevRelease

> Configure project :
com.nextcloud.android.beta: 'annotationProcessor' dependencies won't be recognized as kapt annotation processors. Please change the configuration name to 'kapt' for these artifacts: 'org.parceler:parceler:1.1.12', 'org.projectlombok:lombok:1.18.8'.

> Task :preBuild UP-TO-DATE
> Task :preVersionDevReleaseBuild
> Task :compileVersionDevReleaseAidl
> Task :compileVersionDevReleaseRenderscript NO-SOURCE
> Task :checkVersionDevReleaseManifest
> Task :generateVersionDevReleaseBuildConfig
> Task :mainApkListPersistenceVersionDevRelease
> Task :generateVersionDevReleaseResValues
> Task :generateVersionDevReleaseResources
> Task :mergeVersionDevReleaseResources
> Task :createVersionDevReleaseCompatibleScreenManifests
> Task :processVersionDevReleaseManifest
/home/vagrant/build/com.nextcloud.android.beta/src/main/res/layout/preference_widget_radiobutton.xml:15: warn: generated id 'android:id/checkbox' for external package 'android'.
warn: removing resource com.nextcloud.android.beta:string/actionbar_open_as_richdocument without required default value.
warn: removing resource com.nextcloud.android.beta:string/auth_connecting_auth_server without required default value.
warn: removing resource com.nextcloud.android.beta:string/auth_expired_oauth_token_toast without required default value.
warn: removing resource com.nextcloud.android.beta:string/auth_expired_saml_sso_token_toast without required default value.
warn: removing resource com.nextcloud.android.beta:string/auth_getting_authorization without required default value.
warn: removing resource com.nextcloud.android.beta:string/oauth_2_0_access_end_point_address_hint without required default value.
warn: removing resource com.nextcloud.android.beta:string/oauth_2_0_auth_end_point_address_hint without required default value.
warn: removing resource com.nextcloud.android.beta:string/oauth_check_onoff without required default value.
warn: removing resource com.nextcloud.android.beta:string/oauth_login_connection without required default value.
warn: removing resource com.nextcloud.android.beta:string/whats_new_device_credentials_content without required default value.
warn: removing resource com.nextcloud.android.beta:string/whats_new_device_credentials_title without required default value.

> Task :processVersionDevReleaseResources
> Task :kaptGenerateStubsVersionDevReleaseKotlin

> Task :kaptVersionDevReleaseKotlin
Annotation processors discovery from compile classpath is deprecated.
Set 'kapt.includeCompileClasspath = false' to disable discovery.
Run the build with '--info' for more details.

> Task :compileVersionDevReleaseKotlin
> Task :prepareLintJar
> Task :generateVersionDevReleaseSources
> Task :javaPreCompileVersionDevRelease
> Task :compileVersionDevReleaseJavaWithJavac
/home/vagrant/build/com.nextcloud.android.beta/src/main/java/com/owncloud/android/services/OperationsService.java:57: error: cannot find symbol
import com.owncloud.android.lib.resources.users.GetRemoteUserInfoOperation;
                                               ^
  symbol:   class GetRemoteUserInfoOperation
  location: package com.owncloud.android.lib.resources.users
/home/vagrant/build/com.nextcloud.android.beta/src/main/java/com/owncloud/android/ui/activity/DrawerActivity.java:83: error: cannot find symbol
import com.owncloud.android.lib.resources.users.GetRemoteUserInfoOperation;
                                               ^
  symbol:   class GetRemoteUserInfoOperation
  location: package com.owncloud.android.lib.resources.users
/home/vagrant/build/com.nextcloud.android.beta/src/main/java/com/owncloud/android/providers/UsersAndGroupsSearchProvider.java:42: error: cannot find symbol
import com.owncloud.android.lib.resources.shares.GetRemoteShareesOperation;
                                                ^
  symbol:   class GetRemoteShareesOperation
  location: package com.owncloud.android.lib.resources.shares
/home/vagrant/build/com.nextcloud.android.beta/src/main/java/com/owncloud/android/ui/fragment/OCFileListFragment.java:74: error: cannot find symbol
import com.owncloud.android.lib.resources.shares.GetRemoteSharesOperation;
                                                ^
  symbol:   class GetRemoteSharesOperation
  location: package com.owncloud.android.lib.resources.shares
/home/vagrant/build/com.nextcloud.android.beta/src/main/java/com/owncloud/android/operations/CreateShareViaLinkOperation.java:29: error: cannot find symbol
import com.owncloud.android.lib.resources.shares.CreateRemoteShareOperation;
                                                ^
  symbol:   class CreateRemoteShareOperation
  location: package com.owncloud.android.lib.resources.shares
/home/vagrant/build/com.nextcloud.android.beta/src/main/java/com/owncloud/android/operations/CreateShareViaLinkOperation.java:30: error: cannot find symbol
import com.owncloud.android.lib.resources.shares.GetRemoteSharesForFileOperation;
                                                ^
  symbol:   class GetRemoteSharesForFileOperation
  location: package com.owncloud.android.lib.resources.shares
/home/vagrant/build/com.nextcloud.android.beta/src/main/java/com/owncloud/android/ui/activity/UserInfoActivity.java:65: error: cannot find symbol
import com.owncloud.android.lib.resources.users.GetRemoteUserInfoOperation;
                                               ^
  symbol:   class GetRemoteUserInfoOperation
  location: package com.owncloud.android.lib.resources.users
/home/vagrant/build/com.nextcloud.android.beta/src/main/java/com/owncloud/android/authentication/AuthenticatorActivity.java:113: error: cannot find symbol
import com.owncloud.android.lib.resources.users.GetRemoteUserInfoOperation;
                                               ^
  symbol:   class GetRemoteUserInfoOperation
  location: package com.owncloud.android.lib.resources.users
/home/vagrant/build/com.nextcloud.android.beta/src/main/java/com/owncloud/android/authentication/AuthenticatorAsyncTask.java:33: error: cannot find symbol
import com.owncloud.android.lib.resources.users.GetRemoteUserInfoOperation;
                                               ^
  symbol:   class GetRemoteUserInfoOperation
  location: package com.owncloud.android.lib.resources.users
/home/vagrant/build/com.nextcloud.android.beta/src/main/java/com/owncloud/android/operations/GetServerInfoOperation.java:32: error: cannot find symbol
import com.owncloud.android.lib.resources.status.GetRemoteStatusOperation;
                                                ^
  symbol:   class GetRemoteStatusOperation
  location: package com.owncloud.android.lib.resources.status
/home/vagrant/build/com.nextcloud.android.beta/src/main/java/com/nextcloud/client/account/UserAccountManagerImpl.java:43: error: cannot find symbol
import com.owncloud.android.lib.resources.users.GetRemoteUserInfoOperation;
                                               ^
  symbol:   class GetRemoteUserInfoOperation
  location: package com.owncloud.android.lib.resources.users
/home/vagrant/build/com.nextcloud.android.beta/src/main/java/com/owncloud/android/operations/CreateShareWithShareeOperation.java:29: error: cannot find symbol
import com.owncloud.android.lib.resources.shares.CreateRemoteShareOperation;
                                                ^
  symbol:   class CreateRemoteShareOperation
  location: package com.owncloud.android.lib.resources.shares
/home/vagrant/build/com.nextcloud.android.beta/src/main/java/com/owncloud/android/operations/GetCapabilitiesOperation.java:24: error: cannot find symbol
import com.owncloud.android.lib.resources.status.GetRemoteCapabilitiesOperation;
                                                ^
  symbol:   class GetRemoteCapabilitiesOperation
  location: package com.owncloud.android.lib.resources.status
/home/vagrant/build/com.nextcloud.android.beta/src/main/java/com/owncloud/android/operations/UnshareOperation.java:33: error: cannot find symbol
import com.owncloud.android.lib.resources.shares.RemoveRemoteShareOperation;
                                                ^
  symbol:   class RemoveRemoteShareOperation
  location: package com.owncloud.android.lib.resources.shares
/home/vagrant/build/com.nextcloud.android.beta/src/main/java/com/owncloud/android/operations/GetUserProfileOperation.java:30: error: cannot find symbol
import com.owncloud.android.lib.resources.users.GetRemoteUserInfoOperation;
                                               ^
  symbol:   class GetRemoteUserInfoOperation
  location: package com.owncloud.android.lib.resources.users
/home/vagrant/build/com.nextcloud.android.beta/src/main/java/com/owncloud/android/operations/RefreshFolderOperation.java:38: error: cannot find symbol
import com.owncloud.android.lib.resources.shares.GetRemoteSharesForFileOperation;
                                                ^
  symbol:   class GetRemoteSharesForFileOperation
  location: package com.owncloud.android.lib.resources.shares
/home/vagrant/build/com.nextcloud.android.beta/src/main/java/com/owncloud/android/operations/UpdateShareViaLinkOperation.java:28: error: cannot find symbol
import com.owncloud.android.lib.resources.shares.GetRemoteShareOperation;
                                                ^
  symbol:   class GetRemoteShareOperation
  location: package com.owncloud.android.lib.resources.shares
/home/vagrant/build/com.nextcloud.android.beta/src/main/java/com/owncloud/android/operations/UpdateShareViaLinkOperation.java:31: error: cannot find symbol
import com.owncloud.android.lib.resources.shares.UpdateRemoteShareOperation;
                                                ^
  symbol:   class UpdateRemoteShareOperation
  location: package com.owncloud.android.lib.resources.shares
/home/vagrant/build/com.nextcloud.android.beta/src/main/java/com/owncloud/android/operations/GetSharesForFileOperation.java:27: error: cannot find symbol
import com.owncloud.android.lib.resources.shares.GetRemoteSharesForFileOperation;
                                                ^
  symbol:   class GetRemoteSharesForFileOperation
  location: package com.owncloud.android.lib.resources.shares
/home/vagrant/build/com.nextcloud.android.beta/src/main/java/com/owncloud/android/operations/UpdateNoteForShareOperation.java:27: error: cannot find symbol
import com.owncloud.android.lib.resources.shares.GetRemoteShareOperation;
                                                ^
  symbol:   class GetRemoteShareOperation
  location: package com.owncloud.android.lib.resources.shares
/home/vagrant/build/com.nextcloud.android.beta/src/main/java/com/owncloud/android/operations/UpdateNoteForShareOperation.java:29: error: cannot find symbol
import com.owncloud.android.lib.resources.shares.UpdateRemoteShareOperation;
                                                ^
  symbol:   class UpdateRemoteShareOperation
  location: package com.owncloud.android.lib.resources.shares
/home/vagrant/build/com.nextcloud.android.beta/src/main/java/com/owncloud/android/operations/UpdateSharePermissionsOperation.java:30: error: cannot find symbol
import com.owncloud.android.lib.resources.shares.GetRemoteShareOperation;
                                                ^
  symbol:   class GetRemoteShareOperation
  location: package com.owncloud.android.lib.resources.shares
/home/vagrant/build/com.nextcloud.android.beta/src/main/java/com/owncloud/android/operations/UpdateSharePermissionsOperation.java:32: error: cannot find symbol
import com.owncloud.android.lib.resources.shares.UpdateRemoteShareOperation;
                                                ^
  symbol:   class UpdateRemoteShareOperation
  location: package com.owncloud.android.lib.resources.shares
23 errors

> Task :compileVersionDevReleaseJavaWithJavac FAILED

FAILURE: Build failed with an exception.

* What went wrong:
Execution failed for task ':compileVersionDevReleaseJavaWithJavac'.
> Compilation failed; see the compiler error output for details.

* Try:
Run with --stacktrace option to get the stack trace. Run with --info or --debug option to get more log output. Run with --scan to get full insights.

* Get more help at https://help.gradle.org

Deprecated Gradle features were used in this build, making it incompatible with Gradle 6.0.
Use '--warning-mode all' to show the individual deprecation warnings.
See https://docs.gradle.org/5.1.1/userguide/command_line_interface.html#sec:command_line_warnings

BUILD FAILED in 3m 19s
16 actionable tasks: 16 executed
==== detail end ====