com.nextcloud.android.beta/lastbuild 20190827

From F-Droid
Revision as of 05:09, 21 September 2019 by Robot (Talk | contribs) (Build log)

(diff) ← Older revision | Latest revision (diff) | Newer revision → (diff)
Jump to: navigation, search

Installed Android Tools

Build Log

'Build.py failed on server for com.nextcloud.android.beta:20190827'

detail

== Installed Android Tools ==

INFO: Creating log directory
INFO: Creating temporary directory
INFO: Creating output directory
INFO: Using git version 2.11.0
INFO: Building version 20190827 (20190827) of com.nextcloud.android.beta
INFO: Getting source for revision dev-20190827
INFO: Initialising submodules
INFO: Creating local.properties file at build/com.nextcloud.android.beta/local.properties
INFO: Removing specified files
INFO: Removing gplay.gradle
INFO: Removing user_manual
INFO: Cleaning Gradle project...
INFO: Scanning source for common problems...
INFO: Removing gradle-wrapper.jar at gradle/wrapper/gradle-wrapper.jar
INFO: Removing binary at src/androidTest/assets/srEPevoPqPZpPEaeDnS3
INFO: Removing binary at src/androidTest/assets/n9WXAIXO2wRY4R8nXwmo
INFO: Removing binary at src/androidTest/assets/encrypted/n9WXAIXO2wRY4R8nXwmo
INFO: Removing binary at src/androidTest/assets/encrypted/ia7OEEEyXMoRa1QWQk8r
INFO: Creating source tarball...
INFO: Building Gradle project...
ERROR: Could not build app com.nextcloud.android.beta: Build failed for com.nextcloud.android.beta:20190827
==== detail begin ====
Found 5.4.1 via distributionUrl
Running /opt/gradle/versions/5.4.1/bin/gradle assembleVersionDevRelease

> Configure project :
com.nextcloud.android.beta: 'annotationProcessor' dependencies won't be recognized as kapt annotation processors. Please change the configuration name to 'kapt' for these artifacts: 'org.projectlombok:lombok:1.18.8'.

> Task :preBuild UP-TO-DATE
> Task :preVersionDevReleaseBuild UP-TO-DATE
> Task :compileVersionDevReleaseAidl
> Task :checkVersionDevReleaseManifest
> Task :compileVersionDevReleaseRenderscript NO-SOURCE
> Task :generateVersionDevReleaseBuildConfig
> Task :prepareLintJar
> Task :prepareLintJarForPublish
> Task :generateVersionDevReleaseSources
> Task :dataBindingExportBuildInfoVersionDevRelease
> Task :dataBindingMergeDependencyArtifactsVersionDevRelease
> Task :dataBindingMergeGenClassesVersionDevRelease
> Task :generateVersionDevReleaseResValues
> Task :generateVersionDevReleaseResources
> Task :mergeVersionDevReleaseResources
> Task :dataBindingGenBaseClassesVersionDevRelease
> Task :dataBindingExportFeaturePackageIdsVersionDevRelease
> Task :mainApkListPersistenceVersionDevRelease
> Task :createVersionDevReleaseCompatibleScreenManifests
> Task :processVersionDevReleaseManifest
/home/vagrant/build/com.nextcloud.android.beta/src/main/res/layout/preference_widget_radiobutton.xml:15: warn: generated id 'android:id/checkbox' for external package 'android'.
warn: removing resource com.nextcloud.android.beta:string/actionbar_logger without required default value.
warn: removing resource com.nextcloud.android.beta:string/drawer_item_settings without required default value.
warn: removing resource com.nextcloud.android.beta:string/log_progress_dialog_text without required default value.
warn: removing resource com.nextcloud.android.beta:string/log_send_history_button without required default value.
warn: removing resource com.nextcloud.android.beta:string/power_check_dialog_title without required default value.
warn: removing resource com.nextcloud.android.beta:string/prefs_log_delete_history_button without required default value.
warn: removing resource com.nextcloud.android.beta:string/screenshot_01_gridView without required default value.
warn: removing resource com.nextcloud.android.beta:string/screenshot_02_listView without required default value.
warn: removing resource com.nextcloud.android.beta:string/screenshot_03_drawer without required default value.
warn: removing resource com.nextcloud.android.beta:string/screenshot_04_accounts without required default value.
warn: removing resource com.nextcloud.android.beta:string/screenshot_05_autoUpload without required default value.
warn: removing resource com.nextcloud.android.beta:string/screenshot_06_davdroid without required default value.

> Task :processVersionDevReleaseResources
> Task :kaptGenerateStubsVersionDevReleaseKotlin

> Task :kaptVersionDevReleaseKotlin
Annotation processors discovery from compile classpath is deprecated.
Set 'kapt.includeCompileClasspath = false' to disable discovery.
Run the build with '--info' for more details.
w: [kapt] Incremental annotation processing requested, but support is disabled because the following processors are not incremental: butterknife.compiler.ButterKnifeProcessor (NON_INCREMENTAL).

> Task :compileVersionDevReleaseKotlin
> Task :javaPreCompileVersionDevRelease
> Task :compileVersionDevReleaseJavaWithJavac
/home/vagrant/build/com.nextcloud.android.beta/src/main/java/com/owncloud/android/ui/fragment/FileDetailActivitiesFragment.java:315: error: cannot find symbol
                    getRemoteNotificationOperation.setNextUrl(pageUrl);
                                                  ^
  symbol:   method setNextUrl(String)
  location: variable getRemoteNotificationOperation of type GetActivitiesRemoteOperation
/home/vagrant/build/com.nextcloud.android.beta/src/main/java/com/owncloud/android/ui/activities/data/activities/ActivitiesServiceApiImpl.java:99: error: cannot find symbol
                    getRemoteNotificationOperation.setNextUrl(pageUrl);
                                                  ^
  symbol:   method setNextUrl(String)
  location: variable getRemoteNotificationOperation of type GetActivitiesRemoteOperation
Note: Some input files use or override a deprecated API.
Note: Recompile with -Xlint:deprecation for details.
Note: Some input files use unchecked or unsafe operations.
Note: Recompile with -Xlint:unchecked for details.
2 errors

> Task :compileVersionDevReleaseJavaWithJavac FAILED

FAILURE: Build failed with an exception.

* What went wrong:
Execution failed for task ':compileVersionDevReleaseJavaWithJavac'.
> Compilation failed; see the compiler error output for details.

* Try:
Run with --stacktrace option to get the stack trace. Run with --info or --debug option to get more log output. Run with --scan to get full insights.

* Get more help at https://help.gradle.org

Deprecated Gradle features were used in this build, making it incompatible with Gradle 6.0.
Use '--warning-mode all' to show the individual deprecation warnings.
See https://docs.gradle.org/5.4.1/userguide/command_line_interface.html#sec:command_line_warnings

BUILD FAILED in 5m 16s
21 actionable tasks: 21 executed
==== detail end ====