Difference between revisions of "com.nutomic.syncthingandroid/lastbuild 4286"

From F-Droid
Jump to: navigation, search
(Build log)
 
(Build log)
Line 1: Line 1:
* build session started at 2021-10-06 12:34:56Z
+
* build session started at 2021-10-09 10:06:39Z
* this build started at 2021-10-07 03:40:07Z
+
* this build started at 2021-10-09 21:29:56Z
* this build completed at 2021-10-07 03:47:19Z
+
* this build completed at 2021-10-09 21:37:49Z
* fdroiddata: [https://gitlab.com/fdroid/fdroiddata/commit/9b7a00a2d0b0ffc5891262fa1bdf68361c56dc18 9b7a00a2d0b0ffc5891262fa1bdf68361c56dc18]
+
* fdroiddata: [https://gitlab.com/fdroid/fdroiddata/commit/57bd1eaa7958fdebc5fa2727bac84aabfc21e970 57bd1eaa7958fdebc5fa2727bac84aabfc21e970]
 
* fdroidserverid: [https://gitlab.com/fdroid/fdroidserver/commit/bd079c9311737094e441e9a3e19f8841e9825b89 bd079c9311737094e441e9a3e19f8841e9825b89]
 
* fdroidserverid: [https://gitlab.com/fdroid/fdroidserver/commit/bd079c9311737094e441e9a3e19f8841e9825b89 bd079c9311737094e441e9a3e19f8841e9825b89]
  
Line 17: Line 17:
 
<pre>
 
<pre>
 
[...]
 
[...]
:amd64 (1.46.4-1) ...
+
errors
Setting up libcom-err2:amd64 (1.46.4-1) ...
+
google.golang.org/protobuf/internal/version
Selecting previously unselected package libpcre2-8-0:amd64.
+
github.com/syndtr/goleveldb/leveldb/util
(Reading database ... 64965 files and directories currently installed.)
+
google.golang.org/protobuf/encoding/protowire
Preparing to unpack .../libpcre2-8-0_10.36-2_amd64.deb ...
+
github.com/syndtr/goleveldb/leveldb/storage
Unpacking libpcre2-8-0:amd64 (10.36-2) ...
+
github.com/syncthing/syncthing/lib/svcutil
Setting up libpcre2-8-0:amd64 (10.36-2) ...
+
vendor/golang.org/x/net/idna
(Reading database ... 64972 files and directories currently installed.)
+
runtime/pprof
Preparing to unpack .../libselinux1_3.1-3_amd64.deb ...
+
github.com/syndtr/goleveldb/leveldb/cache
Unpacking libselinux1:amd64 (3.1-3) over (2.6-3+b3) ...
+
google.golang.org/protobuf/reflect/protoreflect
Setting up libselinux1:amd64 (3.1-3) ...
+
github.com/syndtr/goleveldb/leveldb/filter
(Reading database ... 64970 files and directories currently installed.)
+
github.com/syndtr/goleveldb/leveldb/opt
Preparing to unpack .../openssh-sftp-server_1%3a8.4p1-6_amd64.deb ...
+
github.com/gobwas/glob/match
Unpacking openssh-sftp-server (1:8.4p1-6) over (1:7.4p1-10+deb9u7) ...
+
github.com/syndtr/goleveldb/leveldb/errors
Preparing to unpack .../openssh-server_1%3a8.4p1-6_amd64.deb ...
+
github.com/gobwas/glob/syntax/lexer
Unpacking openssh-server (1:8.4p1-6) over (1:7.4p1-10+deb9u7) ...
+
github.com/syndtr/goleveldb/leveldb/iterator
Replacing files in old package openssh-client (1:7.4p1-10+deb9u7) ...
+
github.com/syndtr/goleveldb/leveldb/journal
Preparing to unpack .../openssh-client_1%3a8.4p1-6_amd64.deb ...
+
google.golang.org/protobuf/internal/descfmt
Unpacking openssh-client (1:8.4p1-6) over (1:7.4p1-10+deb9u7) ...
+
google.golang.org/protobuf/internal/descopts
Selecting previously unselected package runit-helper.
+
google.golang.org/protobuf/internal/strs
Preparing to unpack .../runit-helper_2.10.3_all.deb ...
+
google.golang.org/protobuf/internal/encoding/messageset
Unpacking runit-helper (2.10.3) ...
+
google.golang.org/protobuf/internal/genid
Preparing to unpack .../libpam0g_1.4.0-10_amd64.deb ...
+
github.com/gogo/protobuf/protoc-gen-gogo/descriptor
Unpacking libpam0g:amd64 (1.4.0-10) over (1.1.8-3.6) ...
+
github.com/gogo/protobuf/types
Setting up libpam0g:amd64 (1.4.0-10) ...
+
google.golang.org/protobuf/internal/order
Checking for services that may need to be restarted...Checking init scripts...
+
google.golang.org/protobuf/reflect/protoregistry
 +
google.golang.org/protobuf/internal/encoding/text
 +
google.golang.org/protobuf/runtime/protoiface
 +
github.com/syndtr/goleveldb/leveldb/memdb
 +
github.com/syndtr/goleveldb/leveldb/table
 +
google.golang.org/protobuf/proto
 +
github.com/gobwas/glob/syntax/ast
 +
github.com/gobwas/glob/compiler
 +
github.com/gobwas/glob/syntax
 +
google.golang.org/protobuf/internal/encoding/defval
 +
github.com/gobwas/glob
 +
github.com/syncthing/syncthing/lib/build
 +
archive/zip
 +
github.com/go-asn1-ber/asn1-ber
 +
github.com/syndtr/goleveldb/leveldb
 +
google.golang.org/protobuf/internal/filedesc
 +
google.golang.org/protobuf/encoding/prototext
 +
github.com/gogo/protobuf/gogoproto
 +
github.com/syncthing/syncthing/lib/fs
 +
github.com/syncthing/syncthing/proto/ext
 +
github.com/lucas-clemente/quic-go/internal/protocol
 +
golang.org/x/crypto/cryptobyte
 +
golang.org/x/crypto/curve25519
 +
golang.org/x/sys/cpu
 +
github.com/lucas-clemente/quic-go/quicvarint
 +
github.com/calmh/xdr
 +
golang.org/x/time/rate
 +
database/sql/driver
 +
github.com/vitrun/qart/coding
 +
google.golang.org/protobuf/internal/encoding/tag
 +
golang.org/x/crypto/bcrypt
 +
google.golang.org/protobuf/internal/impl
 +
github.com/vitrun/qart/qr
 +
internal/profile
 +
os/signal
 +
github.com/syncthing/syncthing/lib/locations
 +
github.com/syncthing/syncthing/cmd/syncthing/cmdutil
 +
github.com/syncthing/syncthing/lib/db/backend
 +
google.golang.org/protobuf/internal/filetype
 +
google.golang.org/protobuf/runtime/protoimpl
 +
google.golang.org/protobuf/types/known/timestamppb
 +
exit status 2
 +
exit status 1
 +
Traceback (most recent call last):
 +
  File "./build-syncthing.py", line 102, in <module>
 +
    env=environ, cwd=syncthing_dir)
 +
  File "/usr/lib/python2.7/subprocess.py", line 186, in check_call
 +
    raise CalledProcessError(retcode, cmd)
 +
subprocess.CalledProcessError: Command '['go', 'run', 'build.go', '-goos', 'android', '-goarch', 'arm', '-cc', '/opt/android-sdk/ndk/23.0.7599858/toolchains/llvm/prebuilt/linux-x86_64/bin/armv7a-linux-androideabi16-clang', '-pkgdir', '/home/vagrant/build/com.nutomic.syncthingandroid/syncthing/gobuild/go-packages/arm', '-no-upgrade', 'build']' returned non-zero exit status 1
  
Restarting services possibly affected by the upgrade:
+
> Task :syncthing:buildNative FAILED
  
Services restarted successfully.
+
FAILURE: Build failed with an exception.
  
Selecting previously unselected package libcrypt1:amd64.
+
* What went wrong:
(Reading database ... 64989 files and directories currently installed.)
+
Execution failed for task ':syncthing:buildNative'.
Preparing to unpack .../00-libcrypt1_1%3a4.4.25-2_amd64.deb ...
+
> Process 'command 'python'' finished with non-zero exit value 1
Unpacking libcrypt1:amd64 (1:4.4.25-2) ...
+
Replacing files in old package libc6:amd64 (2.24-11+deb9u4) ...
+
Preparing to unpack .../01-libc-dev-bin_2.32-4_amd64.deb ...
+
Unpacking libc-dev-bin (2.32-4) over (2.24-11+deb9u4) ...
+
dpkg: considering deconfiguration of manpages-dev, which would be broken by installation of manpages ...
+
dpkg: yes, will deconfigure manpages-dev (broken by manpages)
+
Preparing to unpack .../02-manpages_5.10-1_all.deb ...
+
De-configuring manpages-dev (4.10-2) ...
+
Unpacking manpages (5.10-1) over (4.10-2) ...
+
Replacing files in old package manpages-dev (4.10-2) ...
+
Preparing to unpack .../03-manpages-dev_5.10-1_all.deb ...
+
Unpacking manpages-dev (5.10-1) over (4.10-2) ...
+
Preparing to unpack .../04-libc6-dev_2.32-4_amd64.deb ...
+
Unpacking libc6-dev:amd64 (2.32-4) over (2.24-11+deb9u4) ...
+
Replacing files in old package libc6:amd64 (2.24-11+deb9u4) ...
+
Selecting previously unselected package libcrypt-dev:amd64.
+
Preparing to unpack .../05-libcrypt-dev_1%3a4.4.25-2_amd64.deb ...
+
Unpacking libcrypt-dev:amd64 (1:4.4.25-2) ...
+
Selecting previously unselected package libtirpc-common.
+
Preparing to unpack .../06-libtirpc-common_1.3.2-2_all.deb ...
+
Unpacking libtirpc-common (1.3.2-2) ...
+
Selecting previously unselected package libtirpc3:amd64.
+
Preparing to unpack .../07-libtirpc3_1.3.2-2_amd64.deb ...
+
Unpacking libtirpc3:amd64 (1.3.2-2) ...
+
Selecting previously unselected package libnsl2:amd64.
+
Preparing to unpack .../08-libnsl2_1.3.0-2_amd64.deb ...
+
Unpacking libnsl2:amd64 (1.3.0-2) ...
+
Selecting previously unselected package libtirpc-dev:amd64.
+
Preparing to unpack .../09-libtirpc-dev_1.3.2-2_amd64.deb ...
+
Unpacking libtirpc-dev:amd64 (1.3.2-2) ...
+
Selecting previously unselected package libnsl-dev:amd64.
+
Preparing to unpack .../10-libnsl-dev_1.3.0-2_amd64.deb ...
+
Unpacking libnsl-dev:amd64 (1.3.0-2) ...
+
Selecting previously unselected package rpcsvc-proto.
+
Preparing to unpack .../11-rpcsvc-proto_1.4.2-4_amd64.deb ...
+
Unpacking rpcsvc-proto (1.4.2-4) ...
+
Preparing to unpack .../12-locales_2.32-4_all.deb ...
+
Unpacking locales (2.32-4) over (2.24-11+deb9u4) ...
+
Preparing to unpack .../13-libc6_2.32-4_amd64.deb ...
+
De-configuring libc6:i386 (2.24-11+deb9u4) ...
+
Checking for services that may need to be restarted...
+
Checking init scripts...
+
grep: /proc/0/maps: No such file or directory
+
Forcing systemd-logind to load NSS modules...
+
Unpacking libc6:amd64 (2.32-4) over (2.24-11+deb9u4) ...
+
Preparing to unpack .../14-libc6_2.32-4_i386.deb ...
+
Checking for services that may need to be restarted...
+
Checking init scripts...
+
grep: /proc/0/maps: No such file or directory
+
Forcing systemd-logind to load NSS modules...
+
Unpacking libc6:i386 (2.32-4) over (2.24-11+deb9u4) ...
+
Preparing to unpack .../15-libc-bin_2.32-4_amd64.deb ...
+
Unpacking libc-bin (2.32-4) over (2.24-11+deb9u4) ...
+
Setting up libc6:amd64 (2.32-4) ...
+
Installing new version of config file /etc/ld.so.conf.d/x86_64-linux-gnu.conf ...
+
Checking for services that may need to be restarted...
+
Checking init scripts...
+
  
Restarting services possibly affected by the upgrade:
+
* Try:
  ssh: restarting...done.
+
Run with --stacktrace option to get the stack trace. Run with --info or --debug option to get more log output. Run with --scan to get full insights.
  cron: restarting...done.
+
  
Services restarted successfully.
+
* Get more help at https://help.gradle.org
Setting up libc6:i386 (2.32-4) ...
+
Installing new version of config file /etc/ld.so.conf.d/i386-linux-gnu.conf ...
+
Checking for services that may need to be restarted...
+
Checking init scripts...
+
Nothing to restart.
+
Setting up libc-bin (2.32-4) ...
+
Updating /etc/nsswitch.conf to current default.
+
Selecting previously unselected package golang-1.16-src.
+
(Reading database ... 65298 files and directories currently installed.)
+
Preparing to unpack .../golang-1.16-src_1.16.8-1_all.deb ...
+
Unpacking golang-1.16-src (1.16.8-1) ...
+
Selecting previously unselected package golang-1.16-go.
+
Preparing to unpack .../golang-1.16-go_1.16.8-1+b1_amd64.deb ...
+
Unpacking golang-1.16-go (1.16.8-1+b1) ...
+
Selecting previously unselected package golang-src:amd64.
+
Preparing to unpack .../golang-src_2%3a1.16~1_amd64.deb ...
+
Unpacking golang-src:amd64 (2:1.16~1) ...
+
Selecting previously unselected package golang-go.
+
Preparing to unpack .../golang-go_2%3a1.16~1_amd64.deb ...
+
Unpacking golang-go (2:1.16~1) ...
+
Setting up manpages (5.10-1) ...
+
Setting up libtirpc-common (1.3.2-2) ...
+
Setting up golang-1.16-src (1.16.8-1) ...
+
Setting up golang-1.16-go (1.16.8-1+b1) ...
+
Setting up runit-helper (2.10.3) ...
+
Setting up golang-src:amd64 (2:1.16~1) ...
+
Setting up libcbor0:amd64 (0.5.0+dfsg-2) ...
+
Setting up golang-go (2:1.16~1) ...
+
Setting up libkrb5support0:amd64 (1.18.3-7) ...
+
Setting up libssl1.1:amd64 (1.1.1l-1) ...
+
locale: Cannot set LC_ALL to default locale: No such file or directory
+
Setting up libcrypt1:amd64 (1:4.4.25-2) ...
+
Setting up libfido2-1:amd64 (1.8.0-1) ...
+
Setting up libc-l10n (2.32-4) ...
+
Setting up rpcsvc-proto (1.4.2-4) ...
+
Processing triggers for systemd (232-25+deb9u13) ...
+
Setting up libcrypt-dev:amd64 (1:4.4.25-2) ...
+
Setting up libc-dev-bin (2.32-4) ...
+
Setting up manpages-dev (5.10-1) ...
+
Setting up locales (2.32-4) ...
+
Installing new version of config file /etc/locale.alias ...
+
Generating locales (this might take a while)...
+
  en_GB.UTF-8... done
+
  en_US.UTF-8... done
+
Generation complete.
+
Setting up libk5crypto3:amd64 (1.18.3-7) ...
+
Setting up libssl-dev:amd64 (1.1.1l-1) ...
+
Setting up libkrb5-3:amd64 (1.18.3-7) ...
+
Setting up libgssapi-krb5-2:amd64 (1.18.3-7) ...
+
Setting up openssh-client (1:8.4p1-6) ...
+
  
Configuration file '/etc/ssh/ssh_config'
+
BUILD FAILED in 31s
==> Modified (by you or by a script) since installation.
+
1 actionable task: 1 executed
==> Package distributor has shipped an updated version.
+
2021-10-09 21:37:31,283 DEBUG: Popen(['git', 'cat-file', '--batch-check'], cwd=/home/vagrant/build/com.nutomic.syncthingandroid, universal_newlines=False, shell=None)
==> Keeping old config file as default.
+
2021-10-09 21:37:31,289 ERROR: Could not build app com.nutomic.syncthingandroid: Build failed for com.nutomic.syncthingandroid:1.18.3@63cb62df320e13029839c9053cf301552c07ae9e
Setting up libtirpc3:amd64 (1.3.2-2) ...
+
==== detail begin ====
Setting up libtirpc-dev:amd64 (1.3.2-2) ...
+
Setting up openssh-sftp-server (1:8.4p1-6) ...
+
Setting up libnsl2:amd64 (1.3.0-2) ...
+
Setting up libnsl-dev:amd64 (1.3.0-2) ...
+
Setting up openssh-server (1:8.4p1-6) ...
+
Installing new version of config file /etc/init.d/ssh ...
+
Installing new version of config file /etc/ssh/moduli ...
+
Replacing config file /etc/ssh/sshd_config with new version
+
/usr/bin/deb-systemd-helper: error: unable to read ssh.service
+
/usr/bin/deb-systemd-helper: error: unable to read ssh.socket
+
Removing obsolete conffile /etc/init/ssh.conf ...
+
Removing obsolete conffile /etc/network/if-up.d/openssh-server ...
+
Setting up libc6-dev:amd64 (2.32-4) ...
+
Processing triggers for libc-bin (2.32-4) ...
+
Processing triggers for systemd (232-25+deb9u13) ...
+
2021-10-07 03:46:05,497 DEBUG: > sudo passwd --lock root
+
passwd: password expiry information changed.
+
2021-10-07 03:46:05,707 DEBUG: > sudo SUDO_FORCE_REMOVE=yes dpkg --purge sudo
+
(Reading database ... 76252 files and directories currently installed.)
+
Removing sudo (1.8.19p1-2.1+deb9u3) ...
+
Purging configuration files for sudo (1.8.19p1-2.1+deb9u3) ...
+
Processing triggers for systemd (232-25+deb9u13) ...
+
2021-10-07 03:46:11,336 INFO: Getting source for revision 63cb62df320e13029839c9053cf301552c07ae9e
+
2021-10-07 03:46:11,337 DEBUG: Directory: build/com.nutomic.syncthingandroid
+
2021-10-07 03:46:11,337 DEBUG: > git rev-parse --show-toplevel
+
2021-10-07 03:46:11,544 DEBUG: Directory: build/com.nutomic.syncthingandroid
+
2021-10-07 03:46:11,544 DEBUG: > git submodule foreach --recursive git reset --hard
+
2021-10-07 03:46:12,160 DEBUG: Directory: build/com.nutomic.syncthingandroid
+
2021-10-07 03:46:12,160 DEBUG: > git reset --hard
+
2021-10-07 03:46:12,466 DEBUG: Directory: build/com.nutomic.syncthingandroid
+
2021-10-07 03:46:12,466 DEBUG: > git submodule foreach --recursive git clean -dffx
+
2021-10-07 03:46:12,671 DEBUG: Directory: build/com.nutomic.syncthingandroid
+
2021-10-07 03:46:12,671 DEBUG: > git clean -dffx
+
2021-10-07 03:46:12,776 DEBUG: Directory: build/com.nutomic.syncthingandroid
+
2021-10-07 03:46:12,777 DEBUG: > git -c core.askpass=/bin/true -c core.sshCommand=/bin/false -c url.https://.insteadOf=ssh:// -c url.https://u:p@bitbucket.org/.insteadOf=git@bitbucket.org: -c url.https://u:p@bitbucket.org.insteadOf=git://bitbucket.org -c url.https://u:p@bitbucket.org.insteadOf=https://bitbucket.org -c url.https://u:p@github.com/.insteadOf=git@github.com: -c url.https://u:p@github.com.insteadOf=git://github.com -c url.https://u:p@github.com.insteadOf=https://github.com -c url.https://u:p@gitlab.com/.insteadOf=git@gitlab.com: -c url.https://u:p@gitlab.com.insteadOf=git://gitlab.com -c url.https://u:p@gitlab.com.insteadOf=https://gitlab.com fetch origin
+
2021-10-07 03:46:13,288 DEBUG: Directory: build/com.nutomic.syncthingandroid
+
2021-10-07 03:46:13,288 DEBUG: > git -c core.askpass=/bin/true -c core.sshCommand=/bin/false -c url.https://.insteadOf=ssh:// -c url.https://u:p@bitbucket.org/.insteadOf=git@bitbucket.org: -c url.https://u:p@bitbucket.org.insteadOf=git://bitbucket.org -c url.https://u:p@bitbucket.org.insteadOf=https://bitbucket.org -c url.https://u:p@github.com/.insteadOf=git@github.com: -c url.https://u:p@github.com.insteadOf=git://github.com -c url.https://u:p@github.com.insteadOf=https://github.com -c url.https://u:p@gitlab.com/.insteadOf=git@gitlab.com: -c url.https://u:p@gitlab.com.insteadOf=git://gitlab.com -c url.https://u:p@gitlab.com.insteadOf=https://gitlab.com fetch --prune --tags --force origin
+
2021-10-07 03:46:13,700 DEBUG: Directory: build/com.nutomic.syncthingandroid
+
2021-10-07 03:46:13,700 DEBUG: > git remote set-head origin --auto
+
2021-10-07 03:46:14,215 DEBUG: Directory: build/com.nutomic.syncthingandroid
+
2021-10-07 03:46:14,216 DEBUG: > git checkout -f 63cb62df320e13029839c9053cf301552c07ae9e
+
2021-10-07 03:46:14,421 DEBUG: Directory: build/com.nutomic.syncthingandroid
+
2021-10-07 03:46:14,421 DEBUG: > git clean -dffx
+
2021-10-07 03:46:14,536 INFO: Initialising submodules
+
2021-10-07 03:46:14,537 DEBUG: Directory: build/com.nutomic.syncthingandroid
+
2021-10-07 03:46:14,537 DEBUG: > git rev-parse --show-toplevel
+
2021-10-07 03:46:14,744 DEBUG: Directory: build/com.nutomic.syncthingandroid
+
2021-10-07 03:46:14,744 DEBUG: > git submodule sync
+
2021-10-07 03:46:14,950 DEBUG: Directory: build/com.nutomic.syncthingandroid
+
2021-10-07 03:46:14,950 DEBUG: > git -c core.askpass=/bin/true -c core.sshCommand=/bin/false -c url.https://.insteadOf=ssh:// -c url.https://u:p@bitbucket.org/.insteadOf=git@bitbucket.org: -c url.https://u:p@bitbucket.org.insteadOf=git://bitbucket.org -c url.https://u:p@bitbucket.org.insteadOf=https://bitbucket.org -c url.https://u:p@github.com/.insteadOf=git@github.com: -c url.https://u:p@github.com.insteadOf=git://github.com -c url.https://u:p@github.com.insteadOf=https://github.com -c url.https://u:p@gitlab.com/.insteadOf=git@gitlab.com: -c url.https://u:p@gitlab.com.insteadOf=git://gitlab.com -c url.https://u:p@gitlab.com.insteadOf=https://gitlab.com submodule update --init --force --recursive
+
Submodule path 'syncthing/src/github.com/syncthing/syncthing': checked out 'e20d4e192d1633a2855f4fa4bcbf8f2f9e61f2c1'
+
2021-10-07 03:46:15,356 INFO: Creating local.properties file at build/com.nutomic.syncthingandroid/local.properties
+
2021-10-07 03:46:15,357 DEBUG: Removing debuggable flags from build/com.nutomic.syncthingandroid
+
2021-10-07 03:46:15,398 INFO: Cleaned build.gradle of keysigning configs at build/com.nutomic.syncthingandroid/app/build.gradle
+
2021-10-07 03:46:15,419 INFO: Running 'prebuild' commands in build/com.nutomic.syncthingandroid
+
2021-10-07 03:46:15,419 DEBUG: Directory: build/com.nutomic.syncthingandroid
+
2021-10-07 03:46:15,419 DEBUG: > bash -x -c -- sed -i -e '/signingConfig/d' app/build.gradle
+
+ sed -i -e /signingConfig/d app/build.gradle
+
2021-10-07 03:46:15,627 INFO: Cleaning Gradle project...
+
2021-10-07 03:46:15,628 DEBUG: Directory: build/com.nutomic.syncthingandroid
+
2021-10-07 03:46:15,628 DEBUG: > /home/vagrant/fdroidserver/gradlew-fdroid clean
+
 
Found 6.9 via distributionUrl
 
Found 6.9 via distributionUrl
Downloading missing gradle version 6.9
+
Running /opt/gradle/versions/6.9/bin/gradle buildNative assembleRelease
cachedir /home/vagrant/.cache/fdroidserver
+
/home/vagrant/.cache/fdroidserver/gradle-6.9-bin.zip: OK
+
Running /opt/gradle/versions/6.9/bin/gradle clean
+
 
+
Welcome to Gradle 6.9!
+
 
+
Here are the highlights of this release:
+
- This is a small backport release.
+
- Java 16 can be used to compile when used with Java toolchains
+
- Dynamic versions can be used within plugin declarations
+
- Native support for Apple Silicon processors
+
 
+
For more details see https://docs.gradle.org/6.9/release-notes.html
+
 
+
 
To honour the JVM settings for this build a single-use Daemon process will be forked. See https://docs.gradle.org/6.9/userguide/gradle_daemon.html#sec:disabling_the_daemon.
 
To honour the JVM settings for this build a single-use Daemon process will be forked. See https://docs.gradle.org/6.9/userguide/gradle_daemon.html#sec:disabling_the_daemon.
 
Daemon will be stopped at the end of the build  
 
Daemon will be stopped at the end of the build  
Line 255: Line 120:
 
Warning: Gradle Play Publisher playConfigs object 'defaultAccountConfig' does not match a variant, flavor, or build type.
 
Warning: Gradle Play Publisher playConfigs object 'defaultAccountConfig' does not match a variant, flavor, or build type.
  
> Task :clean UP-TO-DATE
+
> Task :syncthing:buildNative
> Task :app:clean UP-TO-DATE
+
From https://github.com/syncthing/syncthing
 +
  7c292cc81..e557ba82e  main      -> origin/main
 +
* [new tag]            v0.14      -> v0.14
 +
Building syncthing for arm
 +
Notice: Next generation GUI will not be built; see --with-next-gen-gui.
 +
go: downloading github.com/alecthomas/kong v0.2.17
 +
go: downloading github.com/pkg/errors v0.9.1
 +
go: downloading github.com/thejerf/suture/v4 v4.0.1
 +
go: downloading github.com/AudriusButkevicius/recli v0.0.6
 +
go: downloading github.com/flynn-archive/go-shlex v0.0.0-20150515145356-3f9db97f8568
 +
go: downloading github.com/urfave/cli v1.22.5
 +
go: downloading github.com/syndtr/goleveldb v1.0.1-0.20200815071216-d9e9293bd0f7
 +
go: downloading golang.org/x/net v0.0.0-20210924151903-3ad01bbaa167
 +
go: downloading golang.org/x/sys v0.0.0-20210925032602-92d5a993a665
 +
go: downloading github.com/gogo/protobuf v1.3.2
 +
go: downloading github.com/greatroar/blobloom v0.7.0
 +
go: downloading google.golang.org/protobuf v1.27.1
 +
go: downloading github.com/shirou/gopsutil/v3 v3.21.8
 +
go: downloading github.com/minio/sha256-simd v1.0.0
 +
go: downloading golang.org/x/text v0.3.7
 +
go: downloading github.com/sasha-s/go-deadlock v0.3.1
 +
go: downloading github.com/bkaradzic/go-lz4 v0.0.0-20160924222819-7224d8d8f27e
 +
go: downloading github.com/miscreant/miscreant.go v0.0.0-20200214223636-26d376326b75
 +
go: downloading golang.org/x/crypto v0.0.0-20210921155107-089bfa567519
 +
go: downloading github.com/hashicorp/golang-lru v0.5.4
 +
go: downloading github.com/syncthing/notify v0.0.0-20210616190510-c6b7342338d2
 +
go: downloading github.com/rcrowley/go-metrics v0.0.0-20201227073835-cf1acfcdf475
 +
go: downloading github.com/cpuguy83/go-md2man/v2 v2.0.1
 +
go: downloading github.com/klauspost/cpuid/v2 v2.0.9
 +
go: downloading github.com/petermattis/goid v0.0.0-20180202154549-b0b1615b78e5
 +
go: downloading github.com/go-ldap/ldap/v3 v3.4.1
 +
go: downloading github.com/julienschmidt/httprouter v1.3.0
 +
go: downloading github.com/vitrun/qart v0.0.0-20160531060029-bf64b92db6b0
 +
go: downloading github.com/lucas-clemente/quic-go v0.23.0
 +
go: downloading golang.org/x/time v0.0.0-20210723032227-1f47c861a9ac
 +
go: downloading github.com/gobwas/glob v0.2.3
 +
go: downloading github.com/russross/blackfriday v1.5.2
 +
go: downloading github.com/golang/snappy v0.0.4
 +
go: downloading github.com/russross/blackfriday/v2 v2.1.0
 +
go: downloading github.com/Azure/go-ntlmssp v0.0.0-20200615164410-66371956d46c
 +
go: downloading github.com/go-asn1-ber/asn1-ber v1.5.3
 +
go: downloading github.com/jackpal/gateway v1.0.7
 +
go: downloading github.com/jackpal/go-nat-pmp v1.0.2
 +
go: downloading github.com/AudriusButkevicius/pfilter v0.0.10
 +
go: downloading github.com/ccding/go-stun v0.1.3
 +
go: downloading github.com/chmduquesne/rollinghash v0.0.0-20180912150627-a60f8e7142b5
 +
go: downloading github.com/kballard/go-shellquote v0.0.0-20180428030007-95032a82bc51
 +
go: downloading github.com/calmh/xdr v1.1.0
 +
go: downloading github.com/cheekybits/genny v1.0.0
 +
go: downloading github.com/marten-seemann/qtls-go1-16 v0.1.4
 +
internal/unsafeheader
 +
internal/race
 +
runtime/internal/sys
 +
internal/cpu
 +
unicode/utf8
 +
sync/atomic
 +
unicode
 +
runtime/internal/math
 +
container/list
 +
math/bits
 +
crypto/internal/subtle
 +
crypto/subtle
 +
internal/bytealg
 +
runtime/internal/atomic
 +
unicode/utf16
 +
vendor/golang.org/x/crypto/cryptobyte/asn1
 +
internal/nettrace
 +
vendor/golang.org/x/crypto/internal/subtle
 +
runtime/cgo
 +
math
 +
encoding
 +
# runtime/cgo
 +
/opt/android-sdk/ndk/23.0.7599858/toolchains/llvm/prebuilt/linux-x86_64/bin/clang: line 1: clang-12: command not found
 +
golang.org/x/sys/internal/unsafeheader
 +
golang.org/x/net/internal/iana
 +
golang.org/x/crypto/internal/subtle
 +
google.golang.org/protobuf/internal/flags
 +
runtime
 +
google.golang.org/protobuf/internal/set
 +
hash/maphash
 +
github.com/gobwas/glob/util/runes
 +
github.com/cheekybits/genny/generic
 +
golang.org/x/crypto/cryptobyte/asn1
 +
image/color
 +
github.com/greatroar/blobloom
 +
internal/reflectlite
 +
sync
 +
internal/testlog
 +
internal/singleflight
 +
math/rand
 +
internal/sysinfo
 +
google.golang.org/protobuf/internal/pragma
 +
errors
 +
sort
 +
internal/oserror
 +
io
 +
path
 +
vendor/golang.org/x/net/dns/dnsmessage
 +
strconv
 +
syscall
 +
container/heap
 +
github.com/hashicorp/golang-lru/simplelru
 +
github.com/gogo/protobuf/sortkeys
 +
strings
 +
bytes
 +
hash
 +
crypto/internal/randutil
 +
crypto/hmac
 +
vendor/golang.org/x/crypto/hkdf
 +
text/tabwriter
 +
hash/crc32
 +
html
 +
crypto
 +
reflect
 +
bufio
 +
crypto/rc4
 +
regexp/syntax
 +
github.com/petermattis/goid
 +
golang.org/x/text/transform
 +
hash/fnv
 +
vendor/golang.org/x/text/transform
 +
encoding/base32
 +
golang.org/x/crypto/hkdf
 +
time
 +
internal/syscall/unix
 +
internal/syscall/execenv
 +
golang.org/x/crypto/pbkdf2
 +
github.com/syndtr/goleveldb/leveldb/comparer
 +
github.com/gobwas/glob/util/strings
 +
hash/adler32
 +
golang.org/x/crypto/md4
 +
github.com/kballard/go-shellquote
 +
github.com/chmduquesne/rollinghash
 +
github.com/vitrun/qart/gf256
 +
github.com/chmduquesne/rollinghash/adler32
 +
image
 +
golang.org/x/crypto/blowfish
 +
golang.org/x/text/runes
 +
regexp
 +
context
 +
internal/poll
 +
io/fs
 +
github.com/syncthing/syncthing/lib/weakhash
 +
os
 +
internal/fmtsort
 +
encoding/binary
 +
crypto/sha512
 +
crypto/cipher
 +
crypto/md5
 +
crypto/ed25519/internal/edwards25519
 +
crypto/sha1
 +
crypto/sha256
 +
encoding/base64
 +
crypto/aes
 +
crypto/des
 +
vendor/golang.org/x/crypto/chacha20
 +
fmt
 +
path/filepath
 +
vendor/golang.org/x/crypto/poly1305
 +
encoding/pem
 +
internal/lazyregexp
 +
runtime/debug
 +
golang.org/x/sys/unix
 +
github.com/bkaradzic/go-lz4
 +
vendor/golang.org/x/crypto/chacha20poly1305
 +
io/ioutil
 +
os/exec
 +
github.com/miscreant/miscreant.go/block
 +
github.com/miscreant/miscreant.go/cmac
 +
github.com/miscreant/miscreant.go/pmac
 +
golang.org/x/crypto/chacha20
 +
golang.org/x/crypto/internal/poly1305
 +
golang.org/x/crypto/scrypt
 +
google.golang.org/protobuf/internal/detrand
 +
github.com/golang/snappy
 +
golang.org/x/crypto/chacha20poly1305
 +
golang.org/x/crypto/curve25519/internal/field
 +
math/big
 +
encoding/hex
 +
net/url
 +
vendor/golang.org/x/crypto/curve25519
 +
encoding/json
 +
github.com/pkg/errors
 +
go/token
 +
text/template/parse
 +
os/user
 +
go/scanner
 +
flag
 +
go/ast
 +
github.com/russross/blackfriday/v2
 +
github.com/cpuguy83/go-md2man/v2/md2man
 +
github.com/flynn-archive/go-shlex
 +
text/template
 +
log
 +
compress/flate
 +
crypto/elliptic
 +
encoding/asn1
 +
crypto/rand
 +
crypto/dsa
 +
crypto/ed25519
 +
crypto/rsa
 +
github.com/gogo/protobuf/proto
 +
github.com/hashicorp/golang-lru
 +
compress/gzip
 +
github.com/shirou/gopsutil/v3/internal/common
 +
github.com/syncthing/notify
 +
github.com/syncthing/syncthing/lib/logger
 +
vendor/golang.org/x/crypto/cryptobyte
 +
crypto/x509/pkix
 +
go/doc
 +
github.com/urfave/cli
 +
github.com/shirou/gopsutil/v3/disk
 +
crypto/ecdsa
 +
github.com/klauspost/cpuid/v2
 +
github.com/sasha-s/go-deadlock
 +
golang.org/x/text/unicode/norm
 +
github.com/syncthing/syncthing/lib/sync
 +
github.com/minio/sha256-simd
 +
github.com/alecthomas/kong
 +
runtime/trace
 +
github.com/syncthing/syncthing/lib/sha256
 +
testing
 +
encoding/xml
 +
github.com/thejerf/suture/v4
 +
github.com/AudriusButkevicius/recli
 +
github.com/syncthing/syncthing/lib/connections/registry
 +
golang.org/x/net/bpf
 +
github.com/syncthing/syncthing/lib/events
 +
vendor/golang.org/x/text/unicode/bidi
 +
vendor/golang.org/x/text/unicode/norm
 +
vendor/golang.org/x/net/http2/hpack
 +
mime
 +
mime/quotedprintable
 +
vendor/golang.org/x/text/secure/bidirule
 +
net/http/internal
 +
github.com/miscreant/miscreant.go
 +
github.com/syncthing/syncthing/lib/rand
 +
github.com/syncthing/syncthing/lib/upgrade
 +
google.golang.org/protobuf/internal/errors
 +
google.golang.org/protobuf/internal/version
 +
github.com/syndtr/goleveldb/leveldb/util
 +
google.golang.org/protobuf/encoding/protowire
 +
github.com/syndtr/goleveldb/leveldb/storage
 +
github.com/syncthing/syncthing/lib/svcutil
 +
vendor/golang.org/x/net/idna
 +
runtime/pprof
 +
github.com/syndtr/goleveldb/leveldb/cache
 +
google.golang.org/protobuf/reflect/protoreflect
 +
github.com/syndtr/goleveldb/leveldb/filter
 +
github.com/syndtr/goleveldb/leveldb/opt
 +
github.com/gobwas/glob/match
 +
github.com/syndtr/goleveldb/leveldb/errors
 +
github.com/gobwas/glob/syntax/lexer
 +
github.com/syndtr/goleveldb/leveldb/iterator
 +
github.com/syndtr/goleveldb/leveldb/journal
 +
google.golang.org/protobuf/internal/descfmt
 +
google.golang.org/protobuf/internal/descopts
 +
google.golang.org/protobuf/internal/strs
 +
google.golang.org/protobuf/internal/encoding/messageset
 +
google.golang.org/protobuf/internal/genid
 +
github.com/gogo/protobuf/protoc-gen-gogo/descriptor
 +
github.com/gogo/protobuf/types
 +
google.golang.org/protobuf/internal/order
 +
google.golang.org/protobuf/reflect/protoregistry
 +
google.golang.org/protobuf/internal/encoding/text
 +
google.golang.org/protobuf/runtime/protoiface
 +
github.com/syndtr/goleveldb/leveldb/memdb
 +
github.com/syndtr/goleveldb/leveldb/table
 +
google.golang.org/protobuf/proto
 +
github.com/gobwas/glob/syntax/ast
 +
github.com/gobwas/glob/compiler
 +
github.com/gobwas/glob/syntax
 +
google.golang.org/protobuf/internal/encoding/defval
 +
github.com/gobwas/glob
 +
github.com/syncthing/syncthing/lib/build
 +
archive/zip
 +
github.com/go-asn1-ber/asn1-ber
 +
github.com/syndtr/goleveldb/leveldb
 +
google.golang.org/protobuf/internal/filedesc
 +
google.golang.org/protobuf/encoding/prototext
 +
github.com/gogo/protobuf/gogoproto
 +
github.com/syncthing/syncthing/lib/fs
 +
github.com/syncthing/syncthing/proto/ext
 +
github.com/lucas-clemente/quic-go/internal/protocol
 +
golang.org/x/crypto/cryptobyte
 +
golang.org/x/crypto/curve25519
 +
golang.org/x/sys/cpu
 +
github.com/lucas-clemente/quic-go/quicvarint
 +
github.com/calmh/xdr
 +
golang.org/x/time/rate
 +
database/sql/driver
 +
github.com/vitrun/qart/coding
 +
google.golang.org/protobuf/internal/encoding/tag
 +
golang.org/x/crypto/bcrypt
 +
google.golang.org/protobuf/internal/impl
 +
github.com/vitrun/qart/qr
 +
internal/profile
 +
os/signal
 +
github.com/syncthing/syncthing/lib/locations
 +
github.com/syncthing/syncthing/cmd/syncthing/cmdutil
 +
github.com/syncthing/syncthing/lib/db/backend
 +
google.golang.org/protobuf/internal/filetype
 +
google.golang.org/protobuf/runtime/protoimpl
 +
google.golang.org/protobuf/types/known/timestamppb
 +
exit status 2
 +
exit status 1
 +
Traceback (most recent call last):
 +
  File "./build-syncthing.py", line 102, in <module>
 +
    env=environ, cwd=syncthing_dir)
 +
  File "/usr/lib/python2.7/subprocess.py", line 186, in check_call
 +
    raise CalledProcessError(retcode, cmd)
 +
subprocess.CalledProcessError: Command '['go', 'run', 'build.go', '-goos', 'android', '-goarch', 'arm', '-cc', '/opt/android-sdk/ndk/23.0.7599858/toolchains/llvm/prebuilt/linux-x86_64/bin/armv7a-linux-androideabi16-clang', '-pkgdir', '/home/vagrant/build/com.nutomic.syncthingandroid/syncthing/gobuild/go-packages/arm', '-no-upgrade', 'build']' returned non-zero exit status 1
 +
 
 +
> Task :syncthing:buildNative FAILED
 +
 
 +
FAILURE: Build failed with an exception.
 +
 
 +
* What went wrong:
 +
Execution failed for task ':syncthing:buildNative'.
 +
> Process 'command 'python'' finished with non-zero exit value 1
 +
 
 +
* Try:
 +
Run with --stacktrace option to get the stack trace. Run with --info or --debug option to get more log output. Run with --scan to get full insights.
 +
 
 +
* Get more help at https://help.gradle.org
  
BUILD SUCCESSFUL in 44s
+
BUILD FAILED in 31s
2 actionable tasks: 2 up-to-date
+
1 actionable task: 1 executed
2021-10-07 03:47:05,295 INFO: Scanning source for common problems...
+
==== detail end ====
2021-10-07 03:47:05,300 INFO: Removing gradle-wrapper.jar at gradle/wrapper/gradle-wrapper.jar
+
2021-10-09 21:37:31,298 DEBUG: Error encoutered, stopping by user request.
2021-10-07 03:47:05,308 WARNING: Found executable binary, possibly code at syncthing/src/github.com/syncthing/syncthing/cmd/ursrv/static/fonts/glyphicons-halflings-regular.eot
+
2021-10-07 03:47:05,308 WARNING: Found executable binary, possibly code at syncthing/src/github.com/syncthing/syncthing/cmd/ursrv/static/fonts/glyphicons-halflings-regular.ttf
+
2021-10-07 03:47:05,308 WARNING: Found executable binary, possibly code at syncthing/src/github.com/syncthing/syncthing/cmd/ursrv/static/fonts/glyphicons-halflings-regular.woff
+
2021-10-07 03:47:05,344 INFO: Ignoring binary at syncthing/src/github.com/syncthing/syncthing/lib/model/testdata/tmpfile
+
2021-10-07 03:47:05,377 INFO: Creating source tarball...
+
python3: relocation error: /lib/x86_64-linux-gnu/libnss_files.so.2: symbol __nss_files_fopen, version GLIBC_PRIVATE not defined in file libc.so.6 with link time reference
+
 
</pre>
 
</pre>

Revision as of 21:38, 9 October 2021

Installed Android Tools

Build Log

'Build.py failed on server for com.nutomic.syncthingandroid:1.18.3'

detail

[...]
errors
google.golang.org/protobuf/internal/version
github.com/syndtr/goleveldb/leveldb/util
google.golang.org/protobuf/encoding/protowire
github.com/syndtr/goleveldb/leveldb/storage
github.com/syncthing/syncthing/lib/svcutil
vendor/golang.org/x/net/idna
runtime/pprof
github.com/syndtr/goleveldb/leveldb/cache
google.golang.org/protobuf/reflect/protoreflect
github.com/syndtr/goleveldb/leveldb/filter
github.com/syndtr/goleveldb/leveldb/opt
github.com/gobwas/glob/match
github.com/syndtr/goleveldb/leveldb/errors
github.com/gobwas/glob/syntax/lexer
github.com/syndtr/goleveldb/leveldb/iterator
github.com/syndtr/goleveldb/leveldb/journal
google.golang.org/protobuf/internal/descfmt
google.golang.org/protobuf/internal/descopts
google.golang.org/protobuf/internal/strs
google.golang.org/protobuf/internal/encoding/messageset
google.golang.org/protobuf/internal/genid
github.com/gogo/protobuf/protoc-gen-gogo/descriptor
github.com/gogo/protobuf/types
google.golang.org/protobuf/internal/order
google.golang.org/protobuf/reflect/protoregistry
google.golang.org/protobuf/internal/encoding/text
google.golang.org/protobuf/runtime/protoiface
github.com/syndtr/goleveldb/leveldb/memdb
github.com/syndtr/goleveldb/leveldb/table
google.golang.org/protobuf/proto
github.com/gobwas/glob/syntax/ast
github.com/gobwas/glob/compiler
github.com/gobwas/glob/syntax
google.golang.org/protobuf/internal/encoding/defval
github.com/gobwas/glob
github.com/syncthing/syncthing/lib/build
archive/zip
github.com/go-asn1-ber/asn1-ber
github.com/syndtr/goleveldb/leveldb
google.golang.org/protobuf/internal/filedesc
google.golang.org/protobuf/encoding/prototext
github.com/gogo/protobuf/gogoproto
github.com/syncthing/syncthing/lib/fs
github.com/syncthing/syncthing/proto/ext
github.com/lucas-clemente/quic-go/internal/protocol
golang.org/x/crypto/cryptobyte
golang.org/x/crypto/curve25519
golang.org/x/sys/cpu
github.com/lucas-clemente/quic-go/quicvarint
github.com/calmh/xdr
golang.org/x/time/rate
database/sql/driver
github.com/vitrun/qart/coding
google.golang.org/protobuf/internal/encoding/tag
golang.org/x/crypto/bcrypt
google.golang.org/protobuf/internal/impl
github.com/vitrun/qart/qr
internal/profile
os/signal
github.com/syncthing/syncthing/lib/locations
github.com/syncthing/syncthing/cmd/syncthing/cmdutil
github.com/syncthing/syncthing/lib/db/backend
google.golang.org/protobuf/internal/filetype
google.golang.org/protobuf/runtime/protoimpl
google.golang.org/protobuf/types/known/timestamppb
exit status 2
exit status 1
Traceback (most recent call last):
  File "./build-syncthing.py", line 102, in <module>
    env=environ, cwd=syncthing_dir)
  File "/usr/lib/python2.7/subprocess.py", line 186, in check_call
    raise CalledProcessError(retcode, cmd)
subprocess.CalledProcessError: Command '['go', 'run', 'build.go', '-goos', 'android', '-goarch', 'arm', '-cc', '/opt/android-sdk/ndk/23.0.7599858/toolchains/llvm/prebuilt/linux-x86_64/bin/armv7a-linux-androideabi16-clang', '-pkgdir', '/home/vagrant/build/com.nutomic.syncthingandroid/syncthing/gobuild/go-packages/arm', '-no-upgrade', 'build']' returned non-zero exit status 1

> Task :syncthing:buildNative FAILED

FAILURE: Build failed with an exception.

* What went wrong:
Execution failed for task ':syncthing:buildNative'.
> Process 'command 'python'' finished with non-zero exit value 1

* Try:
Run with --stacktrace option to get the stack trace. Run with --info or --debug option to get more log output. Run with --scan to get full insights.

* Get more help at https://help.gradle.org

BUILD FAILED in 31s
1 actionable task: 1 executed
2021-10-09 21:37:31,283 DEBUG: Popen(['git', 'cat-file', '--batch-check'], cwd=/home/vagrant/build/com.nutomic.syncthingandroid, universal_newlines=False, shell=None)
2021-10-09 21:37:31,289 ERROR: Could not build app com.nutomic.syncthingandroid: Build failed for com.nutomic.syncthingandroid:1.18.3@63cb62df320e13029839c9053cf301552c07ae9e
==== detail begin ====
Found 6.9 via distributionUrl
Running /opt/gradle/versions/6.9/bin/gradle buildNative assembleRelease
To honour the JVM settings for this build a single-use Daemon process will be forked. See https://docs.gradle.org/6.9/userguide/gradle_daemon.html#sec:disabling_the_daemon.
Daemon will be stopped at the end of the build 

> Configure project :app
WARNING: DSL element 'android.dataBinding.enabled' is obsolete and has been replaced with 'android.buildFeatures.dataBinding'.
It will be removed in version 5.0 of the Android Gradle plugin.
Warning: Gradle Play Publisher playConfigs object 'defaultAccountConfig' does not match a variant, flavor, or build type.

> Task :syncthing:buildNative
From https://github.com/syncthing/syncthing
   7c292cc81..e557ba82e  main       -> origin/main
 * [new tag]             v0.14      -> v0.14
Building syncthing for arm
Notice: Next generation GUI will not be built; see --with-next-gen-gui.
go: downloading github.com/alecthomas/kong v0.2.17
go: downloading github.com/pkg/errors v0.9.1
go: downloading github.com/thejerf/suture/v4 v4.0.1
go: downloading github.com/AudriusButkevicius/recli v0.0.6
go: downloading github.com/flynn-archive/go-shlex v0.0.0-20150515145356-3f9db97f8568
go: downloading github.com/urfave/cli v1.22.5
go: downloading github.com/syndtr/goleveldb v1.0.1-0.20200815071216-d9e9293bd0f7
go: downloading golang.org/x/net v0.0.0-20210924151903-3ad01bbaa167
go: downloading golang.org/x/sys v0.0.0-20210925032602-92d5a993a665
go: downloading github.com/gogo/protobuf v1.3.2
go: downloading github.com/greatroar/blobloom v0.7.0
go: downloading google.golang.org/protobuf v1.27.1
go: downloading github.com/shirou/gopsutil/v3 v3.21.8
go: downloading github.com/minio/sha256-simd v1.0.0
go: downloading golang.org/x/text v0.3.7
go: downloading github.com/sasha-s/go-deadlock v0.3.1
go: downloading github.com/bkaradzic/go-lz4 v0.0.0-20160924222819-7224d8d8f27e
go: downloading github.com/miscreant/miscreant.go v0.0.0-20200214223636-26d376326b75
go: downloading golang.org/x/crypto v0.0.0-20210921155107-089bfa567519
go: downloading github.com/hashicorp/golang-lru v0.5.4
go: downloading github.com/syncthing/notify v0.0.0-20210616190510-c6b7342338d2
go: downloading github.com/rcrowley/go-metrics v0.0.0-20201227073835-cf1acfcdf475
go: downloading github.com/cpuguy83/go-md2man/v2 v2.0.1
go: downloading github.com/klauspost/cpuid/v2 v2.0.9
go: downloading github.com/petermattis/goid v0.0.0-20180202154549-b0b1615b78e5
go: downloading github.com/go-ldap/ldap/v3 v3.4.1
go: downloading github.com/julienschmidt/httprouter v1.3.0
go: downloading github.com/vitrun/qart v0.0.0-20160531060029-bf64b92db6b0
go: downloading github.com/lucas-clemente/quic-go v0.23.0
go: downloading golang.org/x/time v0.0.0-20210723032227-1f47c861a9ac
go: downloading github.com/gobwas/glob v0.2.3
go: downloading github.com/russross/blackfriday v1.5.2
go: downloading github.com/golang/snappy v0.0.4
go: downloading github.com/russross/blackfriday/v2 v2.1.0
go: downloading github.com/Azure/go-ntlmssp v0.0.0-20200615164410-66371956d46c
go: downloading github.com/go-asn1-ber/asn1-ber v1.5.3
go: downloading github.com/jackpal/gateway v1.0.7
go: downloading github.com/jackpal/go-nat-pmp v1.0.2
go: downloading github.com/AudriusButkevicius/pfilter v0.0.10
go: downloading github.com/ccding/go-stun v0.1.3
go: downloading github.com/chmduquesne/rollinghash v0.0.0-20180912150627-a60f8e7142b5
go: downloading github.com/kballard/go-shellquote v0.0.0-20180428030007-95032a82bc51
go: downloading github.com/calmh/xdr v1.1.0
go: downloading github.com/cheekybits/genny v1.0.0
go: downloading github.com/marten-seemann/qtls-go1-16 v0.1.4
internal/unsafeheader
internal/race
runtime/internal/sys
internal/cpu
unicode/utf8
sync/atomic
unicode
runtime/internal/math
container/list
math/bits
crypto/internal/subtle
crypto/subtle
internal/bytealg
runtime/internal/atomic
unicode/utf16
vendor/golang.org/x/crypto/cryptobyte/asn1
internal/nettrace
vendor/golang.org/x/crypto/internal/subtle
runtime/cgo
math
encoding
# runtime/cgo
/opt/android-sdk/ndk/23.0.7599858/toolchains/llvm/prebuilt/linux-x86_64/bin/clang: line 1: clang-12: command not found
golang.org/x/sys/internal/unsafeheader
golang.org/x/net/internal/iana
golang.org/x/crypto/internal/subtle
google.golang.org/protobuf/internal/flags
runtime
google.golang.org/protobuf/internal/set
hash/maphash
github.com/gobwas/glob/util/runes
github.com/cheekybits/genny/generic
golang.org/x/crypto/cryptobyte/asn1
image/color
github.com/greatroar/blobloom
internal/reflectlite
sync
internal/testlog
internal/singleflight
math/rand
internal/sysinfo
google.golang.org/protobuf/internal/pragma
errors
sort
internal/oserror
io
path
vendor/golang.org/x/net/dns/dnsmessage
strconv
syscall
container/heap
github.com/hashicorp/golang-lru/simplelru
github.com/gogo/protobuf/sortkeys
strings
bytes
hash
crypto/internal/randutil
crypto/hmac
vendor/golang.org/x/crypto/hkdf
text/tabwriter
hash/crc32
html
crypto
reflect
bufio
crypto/rc4
regexp/syntax
github.com/petermattis/goid
golang.org/x/text/transform
hash/fnv
vendor/golang.org/x/text/transform
encoding/base32
golang.org/x/crypto/hkdf
time
internal/syscall/unix
internal/syscall/execenv
golang.org/x/crypto/pbkdf2
github.com/syndtr/goleveldb/leveldb/comparer
github.com/gobwas/glob/util/strings
hash/adler32
golang.org/x/crypto/md4
github.com/kballard/go-shellquote
github.com/chmduquesne/rollinghash
github.com/vitrun/qart/gf256
github.com/chmduquesne/rollinghash/adler32
image
golang.org/x/crypto/blowfish
golang.org/x/text/runes
regexp
context
internal/poll
io/fs
github.com/syncthing/syncthing/lib/weakhash
os
internal/fmtsort
encoding/binary
crypto/sha512
crypto/cipher
crypto/md5
crypto/ed25519/internal/edwards25519
crypto/sha1
crypto/sha256
encoding/base64
crypto/aes
crypto/des
vendor/golang.org/x/crypto/chacha20
fmt
path/filepath
vendor/golang.org/x/crypto/poly1305
encoding/pem
internal/lazyregexp
runtime/debug
golang.org/x/sys/unix
github.com/bkaradzic/go-lz4
vendor/golang.org/x/crypto/chacha20poly1305
io/ioutil
os/exec
github.com/miscreant/miscreant.go/block
github.com/miscreant/miscreant.go/cmac
github.com/miscreant/miscreant.go/pmac
golang.org/x/crypto/chacha20
golang.org/x/crypto/internal/poly1305
golang.org/x/crypto/scrypt
google.golang.org/protobuf/internal/detrand
github.com/golang/snappy
golang.org/x/crypto/chacha20poly1305
golang.org/x/crypto/curve25519/internal/field
math/big
encoding/hex
net/url
vendor/golang.org/x/crypto/curve25519
encoding/json
github.com/pkg/errors
go/token
text/template/parse
os/user
go/scanner
flag
go/ast
github.com/russross/blackfriday/v2
github.com/cpuguy83/go-md2man/v2/md2man
github.com/flynn-archive/go-shlex
text/template
log
compress/flate
crypto/elliptic
encoding/asn1
crypto/rand
crypto/dsa
crypto/ed25519
crypto/rsa
github.com/gogo/protobuf/proto
github.com/hashicorp/golang-lru
compress/gzip
github.com/shirou/gopsutil/v3/internal/common
github.com/syncthing/notify
github.com/syncthing/syncthing/lib/logger
vendor/golang.org/x/crypto/cryptobyte
crypto/x509/pkix
go/doc
github.com/urfave/cli
github.com/shirou/gopsutil/v3/disk
crypto/ecdsa
github.com/klauspost/cpuid/v2
github.com/sasha-s/go-deadlock
golang.org/x/text/unicode/norm
github.com/syncthing/syncthing/lib/sync
github.com/minio/sha256-simd
github.com/alecthomas/kong
runtime/trace
github.com/syncthing/syncthing/lib/sha256
testing
encoding/xml
github.com/thejerf/suture/v4
github.com/AudriusButkevicius/recli
github.com/syncthing/syncthing/lib/connections/registry
golang.org/x/net/bpf
github.com/syncthing/syncthing/lib/events
vendor/golang.org/x/text/unicode/bidi
vendor/golang.org/x/text/unicode/norm
vendor/golang.org/x/net/http2/hpack
mime
mime/quotedprintable
vendor/golang.org/x/text/secure/bidirule
net/http/internal
github.com/miscreant/miscreant.go
github.com/syncthing/syncthing/lib/rand
github.com/syncthing/syncthing/lib/upgrade
google.golang.org/protobuf/internal/errors
google.golang.org/protobuf/internal/version
github.com/syndtr/goleveldb/leveldb/util
google.golang.org/protobuf/encoding/protowire
github.com/syndtr/goleveldb/leveldb/storage
github.com/syncthing/syncthing/lib/svcutil
vendor/golang.org/x/net/idna
runtime/pprof
github.com/syndtr/goleveldb/leveldb/cache
google.golang.org/protobuf/reflect/protoreflect
github.com/syndtr/goleveldb/leveldb/filter
github.com/syndtr/goleveldb/leveldb/opt
github.com/gobwas/glob/match
github.com/syndtr/goleveldb/leveldb/errors
github.com/gobwas/glob/syntax/lexer
github.com/syndtr/goleveldb/leveldb/iterator
github.com/syndtr/goleveldb/leveldb/journal
google.golang.org/protobuf/internal/descfmt
google.golang.org/protobuf/internal/descopts
google.golang.org/protobuf/internal/strs
google.golang.org/protobuf/internal/encoding/messageset
google.golang.org/protobuf/internal/genid
github.com/gogo/protobuf/protoc-gen-gogo/descriptor
github.com/gogo/protobuf/types
google.golang.org/protobuf/internal/order
google.golang.org/protobuf/reflect/protoregistry
google.golang.org/protobuf/internal/encoding/text
google.golang.org/protobuf/runtime/protoiface
github.com/syndtr/goleveldb/leveldb/memdb
github.com/syndtr/goleveldb/leveldb/table
google.golang.org/protobuf/proto
github.com/gobwas/glob/syntax/ast
github.com/gobwas/glob/compiler
github.com/gobwas/glob/syntax
google.golang.org/protobuf/internal/encoding/defval
github.com/gobwas/glob
github.com/syncthing/syncthing/lib/build
archive/zip
github.com/go-asn1-ber/asn1-ber
github.com/syndtr/goleveldb/leveldb
google.golang.org/protobuf/internal/filedesc
google.golang.org/protobuf/encoding/prototext
github.com/gogo/protobuf/gogoproto
github.com/syncthing/syncthing/lib/fs
github.com/syncthing/syncthing/proto/ext
github.com/lucas-clemente/quic-go/internal/protocol
golang.org/x/crypto/cryptobyte
golang.org/x/crypto/curve25519
golang.org/x/sys/cpu
github.com/lucas-clemente/quic-go/quicvarint
github.com/calmh/xdr
golang.org/x/time/rate
database/sql/driver
github.com/vitrun/qart/coding
google.golang.org/protobuf/internal/encoding/tag
golang.org/x/crypto/bcrypt
google.golang.org/protobuf/internal/impl
github.com/vitrun/qart/qr
internal/profile
os/signal
github.com/syncthing/syncthing/lib/locations
github.com/syncthing/syncthing/cmd/syncthing/cmdutil
github.com/syncthing/syncthing/lib/db/backend
google.golang.org/protobuf/internal/filetype
google.golang.org/protobuf/runtime/protoimpl
google.golang.org/protobuf/types/known/timestamppb
exit status 2
exit status 1
Traceback (most recent call last):
  File "./build-syncthing.py", line 102, in <module>
    env=environ, cwd=syncthing_dir)
  File "/usr/lib/python2.7/subprocess.py", line 186, in check_call
    raise CalledProcessError(retcode, cmd)
subprocess.CalledProcessError: Command '['go', 'run', 'build.go', '-goos', 'android', '-goarch', 'arm', '-cc', '/opt/android-sdk/ndk/23.0.7599858/toolchains/llvm/prebuilt/linux-x86_64/bin/armv7a-linux-androideabi16-clang', '-pkgdir', '/home/vagrant/build/com.nutomic.syncthingandroid/syncthing/gobuild/go-packages/arm', '-no-upgrade', 'build']' returned non-zero exit status 1

> Task :syncthing:buildNative FAILED

FAILURE: Build failed with an exception.

* What went wrong:
Execution failed for task ':syncthing:buildNative'.
> Process 'command 'python'' finished with non-zero exit value 1

* Try:
Run with --stacktrace option to get the stack trace. Run with --info or --debug option to get more log output. Run with --scan to get full insights.

* Get more help at https://help.gradle.org

BUILD FAILED in 31s
1 actionable task: 1 executed
==== detail end ====
2021-10-09 21:37:31,298 DEBUG: Error encoutered, stopping by user request.