com.tutpro.baresip.plus/lastbuild 27

From F-Droid
Revision as of 00:24, 24 January 2021 by Robot (Talk | contribs) (Build log)

(diff) ← Older revision | Latest revision (diff) | Newer revision → (diff)
Jump to: navigation, search

Installed Android Tools

Build Log

'Build.py failed on server for com.tutpro.baresip.plus:11.0.1'

detail

[...]
g Gradle project...
2021-01-24 00:24:13,352 ERROR: Could not build app com.tutpro.baresip.plus: Build failed for com.tutpro.baresip.plus:11.0.1@07f5bfcf0b147029a3b45f38567ca447788668d9
==== detail begin ====
Found 6.5 via distributionUrl
Running /opt/gradle/versions/6.5/bin/gradle assembleRelease
To honour the JVM settings for this build a new JVM will be forked. Please consider using the daemon: https://docs.gradle.org/6.5/userguide/gradle_daemon.html.
Daemon will be stopped at the end of the build stopping after processing

> Configure project :app
Warning: The 'kotlin-android-extensions' Gradle plugin is deprecated. Please use this migration guide (https://goo.gle/kotlin-android-extensions-deprecation) to start working with View Binding (https://developer.android.com/topic/libraries/view-binding) and the 'kotlin-parcelize' plugin.
WARNING: NDK was located by using ndk.dir property. This method is deprecated and will be removed in a future release. Please use android.ndkVersion or android.ndkPath in build.gradle to specify the NDK to use. https://developer.android.com/r/studio-ui/ndk-dir
NDK was located by using ndk.dir property. This method is deprecated and will be removed in a future release. Please use android.ndkVersion or android.ndkPath in build.gradle to specify the NDK to use. https://developer.android.com/r/studio-ui/ndk-dir

> Task :app:preBuild UP-TO-DATE
> Task :app:preReleaseBuild UP-TO-DATE
> Task :app:compileReleaseAidl NO-SOURCE
> Task :app:compileReleaseRenderscript NO-SOURCE
> Task :app:dataBindingMergeDependencyArtifactsRelease
> Task :app:dataBindingMergeGenClassesRelease
> Task :app:generateReleaseResValues
> Task :app:generateReleaseResources
> Task :app:generateReleaseBuildConfig
> Task :app:checkReleaseAarMetadata
> Task :app:createReleaseCompatibleScreenManifests
> Task :app:extractDeepLinksRelease
> Task :app:mergeReleaseResources
> Task :app:processReleaseMainManifest
> Task :app:dataBindingGenBaseClassesRelease
> Task :app:processReleaseManifest
> Task :app:javaPreCompileRelease
> Task :app:generateJsonModelRelease

> Task :app:externalNativeBuildRelease FAILED
Build baresip_armeabi-v7a
ninja: Entering directory `/home/vagrant/build/com.tutpro.baresip.plus/app/.cxx/cmake/release/armeabi-v7a'
[1/3] Building C object CMakeFiles/baresip.dir/vidisp.c.o
clang: warning: -Z-reserved-lib-stdc++: 'linker' input unused [-Wunused-command-line-argument]
[2/3] Building C object CMakeFiles/baresip.dir/baresip.c.o
clang: warning: -Z-reserved-lib-stdc++: 'linker' input unused [-Wunused-command-line-argument]
/home/vagrant/build/com.tutpro.baresip.plus/app/src/main/cpp/baresip.c:591:43: warning: implicit declaration of function 'ua_aor' is invalid in C99 [-Wimplicit-function-declaration]
        LOGD("adding UA for AoR %s/%s\n", ua_aor(ua), ua_buf);
                                          ^
/home/vagrant/build/com.tutpro.baresip.plus/app/src/main/cpp/baresip.c:591:43: warning: format specifies type 'char *' but the argument has type 'int' [-Wformat]
        LOGD("adding UA for AoR %s/%s\n", ua_aor(ua), ua_buf);
                                ~~        ^~~~~~~~~~
                                %d
/home/vagrant/build/com.tutpro.baresip.plus/app/src/main/cpp/logger.h:9:64: note: expanded from macro 'LOGD'
        ((void)__android_log_print(ANDROID_LOG_DEBUG, LOG_TAG, __VA_ARGS__))
                                                               ^~~~~~~~~~~
2 warnings generated.
[3/3] Linking C shared library /home/vagrant/build/com.tutpro.baresip.plus/app/build/intermediates/cmake/release/obj/armeabi-v7a/libbaresip.so
FAILED: /home/vagrant/build/com.tutpro.baresip.plus/app/build/intermediates/cmake/release/obj/armeabi-v7a/libbaresip.so 
: && /home/vagrant/android-ndk/r21d/toolchains/llvm/prebuilt/linux-x86_64/bin/clang --target=armv7-none-linux-androideabi24 --gcc-toolchain=/home/vagrant/android-ndk/r21d/toolchains/llvm/prebuilt/linux-x86_64 --sysroot=/home/vagrant/android-ndk/r21d/toolchains/llvm/prebuilt/linux-x86_64/sysroot -fPIC -g -DANDROID -fdata-sections -ffunction-sections -funwind-tables -fstack-protector-strong -no-canonical-prefixes -D_FORTIFY_SOURCE=2 -march=armv7-a -mthumb -Wformat -Werror=format-security -DHAVE_INTTYPES_H -lstdc++ -Oz -DNDEBUG  -Wl,--exclude-libs,libgcc.a -Wl,--exclude-libs,libgcc_real.a -Wl,--exclude-libs,libatomic.a -Wl,--build-id -Wl,--fatal-warnings -Wl,--exclude-libs,libunwind.a -Wl,--no-undefined -Qunused-arguments -shared -Wl,-soname,libbaresip.so -o /home/vagrant/build/com.tutpro.baresip.plus/app/build/intermediates/cmake/release/obj/armeabi-v7a/libbaresip.so CMakeFiles/baresip.dir/baresip.c.o CMakeFiles/baresip.dir/vidisp.c.o  -landroid -lEGL -lGLESv2 -lGLESv1_CM -lOpenSLES /home/vagrant/build/com.tutpro.baresip.plus/app/src/main/cpp/../../../../distribution.video/baresip/lib/armeabi-v7a/libbaresip.a /home/vagrant/build/com.tutpro.baresip.plus/app/src/main/cpp/../../../../distribution.video/rem/lib/armeabi-v7a/librem.a /home/vagrant/build/com.tutpro.baresip.plus/app/src/main/cpp/../../../../distribution.video/re/lib/armeabi-v7a/libre.a /home/vagrant/build/com.tutpro.baresip.plus/app/src/main/cpp/../../../../distribution.video/openssl/lib/armeabi-v7a/libssl.a /home/vagrant/build/com.tutpro.baresip.plus/app/src/main/cpp/../../../../distribution.video/openssl/lib/armeabi-v7a/libcrypto.a /home/vagrant/build/com.tutpro.baresip.plus/app/src/main/cpp/../../../../distribution.video/opus/lib/armeabi-v7a/libopus.a /home/vagrant/build/com.tutpro.baresip.plus/app/src/main/cpp/../../../../distribution.video/ffmpeg/lib/armeabi-v7a/libavdevice.so /home/vagrant/build/com.tutpro.baresip.plus/app/src/main/cpp/../../../../distribution.video/ffmpeg/lib/armeabi-v7a/libavfilter.so /home/vagrant/build/com.tutpro.baresip.plus/app/src/main/cpp/../../../../distribution.video/ffmpeg/lib/armeabi-v7a/libswscale.so /home/vagrant/build/com.tutpro.baresip.plus/app/src/main/cpp/../../../../distribution.video/ffmpeg/lib/armeabi-v7a/libavformat.so /home/vagrant/build/com.tutpro.baresip.plus/app/src/main/cpp/../../../../distribution.video/ffmpeg/lib/armeabi-v7a/libavcodec.so /home/vagrant/build/com.tutpro.baresip.plus/app/src/main/cpp/../../../../distribution.video/x264/lib/armeabi-v7a/libx264.a /home/vagrant/build/com.tutpro.baresip.plus/app/src/main/cpp/../../../../distribution.video/x265/lib/armeabi-v7a/libx265.a /home/vagrant/build/com.tutpro.baresip.plus/app/src/main/cpp/../../../../distribution.video/vpx/lib/armeabi-v7a/libvpx.a /home/vagrant/build/com.tutpro.baresip.plus/app/src/main/cpp/../../../../distribution.video/ffmpeg/lib/armeabi-v7a/libavutil.so /home/vagrant/build/com.tutpro.baresip.plus/app/src/main/cpp/../../../../distribution.video/ffmpeg/lib/armeabi-v7a/libswresample.so /home/vagrant/build/com.tutpro.baresip.plus/app/src/main/cpp/../../../../distribution.video/ffmpeg/lib/armeabi-v7a/libpostproc.so /home/vagrant/build/com.tutpro.baresip.plus/app/src/main/cpp/../../../../distribution.video/spandsp/lib/armeabi-v7a/libspandsp.a /home/vagrant/build/com.tutpro.baresip.plus/app/src/main/cpp/../../../../distribution.video/g7221/lib/armeabi-v7a/libg722_1.a /home/vagrant/build/com.tutpro.baresip.plus/app/src/main/cpp/../../../../distribution.video/g729/lib/armeabi-v7a/libbcg729.a /home/vagrant/build/com.tutpro.baresip.plus/app/src/main/cpp/../../../../distribution.video/ilbc/lib/armeabi-v7a/libilbc.a /home/vagrant/build/com.tutpro.baresip.plus/app/src/main/cpp/../../../../distribution.video/amr/lib/armeabi-v7a/libamrnb.a /home/vagrant/build/com.tutpro.baresip.plus/app/src/main/cpp/../../../../distribution.video/amr/lib/armeabi-v7a/libamrwb.a /home/vagrant/build/com.tutpro.baresip.plus/app/src/main/cpp/../../../../distribution.video/amr/lib/armeabi-v7a/libamrwbenc.a /home/vagrant/build/com.tutpro.baresip.plus/app/src/main/cpp/../../../../distribution.video/webrtc/lib/armeabi-v7a/libwebrtc.a /home/vagrant/build/com.tutpro.baresip.plus/app/src/main/cpp/../../../../distribution.video/zrtp/lib/armeabi-v7a/libzrtp.a /home/vagrant/build/com.tutpro.baresip.plus/app/src/main/cpp/../../../../distribution.video/bn/lib/armeabi-v7a/libbn.a -lz -llog -lcamera2ndk /home/vagrant/build/com.tutpro.baresip.plus/app/src/main/cpp/../../../../distribution.video/cpu_features/lib/armeabi-v7a/libcpu_features.a /home/vagrant/build/com.tutpro.baresip.plus/app/src/main/cpp/../../../../distribution.video/cpu_features/lib/armeabi-v7a/libndk_compat.a -lmediandk -latomic -lm && :
/home/vagrant/build/com.tutpro.baresip.plus/app/src/main/cpp/baresip.c:591: error: undefined reference to 'ua_aor'
clang: error: linker command failed with exit code 1 (use -v to see invocation)
ninja: build stopped: subcommand failed.

> Task :app:processReleaseManifestForPackage

FAILURE: Build failed with an exception.

* What went wrong:
Execution failed for task ':app:externalNativeBuildRelease'.
> Build command failed.
  Error while executing process /home/vagrant/android-sdk/cmake/3.10.2.4988404/bin/ninja with arguments {-C /home/vagrant/build/com.tutpro.baresip.plus/app/.cxx/cmake/release/armeabi-v7a baresip}
  ninja: Entering directory `/home/vagrant/build/com.tutpro.baresip.plus/app/.cxx/cmake/release/armeabi-v7a'
  [1/3] Building C object CMakeFiles/baresip.dir/vidisp.c.o
  clang: warning: -Z-reserved-lib-stdc++: 'linker' input unused [-Wunused-command-line-argument]
  [2/3] Building C object CMakeFiles/baresip.dir/baresip.c.o
  clang: warning: -Z-reserved-lib-stdc++: 'linker' input unused [-Wunused-command-line-argument]
  /home/vagrant/build/com.tutpro.baresip.plus/app/src/main/cpp/baresip.c:591:43: warning: implicit declaration of function 'ua_aor' is invalid in C99 [-Wimplicit-function-declaration]
          LOGD("adding UA for AoR %s/%s\n", ua_aor(ua), ua_buf);
                                            ^
  /home/vagrant/build/com.tutpro.baresip.plus/app/src/main/cpp/baresip.c:591:43: warning: format specifies type 'char *' but the argument has type 'int' [-Wformat]
          LOGD("adding UA for AoR %s/%s\n", ua_aor(ua), ua_buf);
                                  ~~        ^~~~~~~~~~
                                  %d
  /home/vagrant/build/com.tutpro.baresip.plus/app/src/main/cpp/logger.h:9:64: note: expanded from macro 'LOGD'
          ((void)__android_log_print(ANDROID_LOG_DEBUG, LOG_TAG, __VA_ARGS__))
                                                                 ^~~~~~~~~~~
  2 warnings generated.
  [3/3] Linking C shared library /home/vagrant/build/com.tutpro.baresip.plus/app/build/intermediates/cmake/release/obj/armeabi-v7a/libbaresip.so
  FAILED: /home/vagrant/build/com.tutpro.baresip.plus/app/build/intermediates/cmake/release/obj/armeabi-v7a/libbaresip.so 
  : && /home/vagrant/android-ndk/r21d/toolchains/llvm/prebuilt/linux-x86_64/bin/clang --target=armv7-none-linux-androideabi24 --gcc-toolchain=/home/vagrant/android-ndk/r21d/toolchains/llvm/prebuilt/linux-x86_64 --sysroot=/home/vagrant/android-ndk/r21d/toolchains/llvm/prebuilt/linux-x86_64/sysroot -fPIC -g -DANDROID -fdata-sections -ffunction-sections -funwind-tables -fstack-protector-strong -no-canonical-prefixes -D_FORTIFY_SOURCE=2 -march=armv7-a -mthumb -Wformat -Werror=format-security -DHAVE_INTTYPES_H -lstdc++ -Oz -DNDEBUG  -Wl,--exclude-libs,libgcc.a -Wl,--exclude-libs,libgcc_real.a -Wl,--exclude-libs,libatomic.a -Wl,--build-id -Wl,--fatal-warnings -Wl,--exclude-libs,libunwind.a -Wl,--no-undefined -Qunused-arguments -shared -Wl,-soname,libbaresip.so -o /home/vagrant/build/com.tutpro.baresip.plus/app/build/intermediates/cmake/release/obj/armeabi-v7a/libbaresip.so CMakeFiles/baresip.dir/baresip.c.o CMakeFiles/baresip.dir/vidisp.c.o  -landroid -lEGL -lGLESv2 -lGLESv1_CM -lOpenSLES /home/vagrant/build/com.tutpro.baresip.plus/app/src/main/cpp/../../../../distribution.video/baresip/lib/armeabi-v7a/libbaresip.a /home/vagrant/build/com.tutpro.baresip.plus/app/src/main/cpp/../../../../distribution.video/rem/lib/armeabi-v7a/librem.a /home/vagrant/build/com.tutpro.baresip.plus/app/src/main/cpp/../../../../distribution.video/re/lib/armeabi-v7a/libre.a /home/vagrant/build/com.tutpro.baresip.plus/app/src/main/cpp/../../../../distribution.video/openssl/lib/armeabi-v7a/libssl.a /home/vagrant/build/com.tutpro.baresip.plus/app/src/main/cpp/../../../../distribution.video/openssl/lib/armeabi-v7a/libcrypto.a /home/vagrant/build/com.tutpro.baresip.plus/app/src/main/cpp/../../../../distribution.video/opus/lib/armeabi-v7a/libopus.a /home/vagrant/build/com.tutpro.baresip.plus/app/src/main/cpp/../../../../distribution.video/ffmpeg/lib/armeabi-v7a/libavdevice.so /home/vagrant/build/com.tutpro.baresip.plus/app/src/main/cpp/../../../../distribution.video/ffmpeg/lib/armeabi-v7a/libavfilter.so /home/vagrant/build/com.tutpro.baresip.plus/app/src/main/cpp/../../../../distribution.video/ffmpeg/lib/armeabi-v7a/libswscale.so /home/vagrant/build/com.tutpro.baresip.plus/app/src/main/cpp/../../../../distribution.video/ffmpeg/lib/armeabi-v7a/libavformat.so /home/vagrant/build/com.tutpro.baresip.plus/app/src/main/cpp/../../../../distribution.video/ffmpeg/lib/armeabi-v7a/libavcodec.so /home/vagrant/build/com.tutpro.baresip.plus/app/src/main/cpp/../../../../distribution.video/x264/lib/armeabi-v7a/libx264.a /home/vagrant/build/com.tutpro.baresip.plus/app/src/main/cpp/../../../../distribution.video/x265/lib/armeabi-v7a/libx265.a /home/vagrant/build/com.tutpro.baresip.plus/app/src/main/cpp/../../../../distribution.video/vpx/lib/armeabi-v7a/libvpx.a /home/vagrant/build/com.tutpro.baresip.plus/app/src/main/cpp/../../../../distribution.video/ffmpeg/lib/armeabi-v7a/libavutil.so /home/vagrant/build/com.tutpro.baresip.plus/app/src/main/cpp/../../../../distribution.video/ffmpeg/lib/armeabi-v7a/libswresample.so /home/vagrant/build/com.tutpro.baresip.plus/app/src/main/cpp/../../../../distribution.video/ffmpeg/lib/armeabi-v7a/libpostproc.so /home/vagrant/build/com.tutpro.baresip.plus/app/src/main/cpp/../../../../distribution.video/spandsp/lib/armeabi-v7a/libspandsp.a /home/vagrant/build/com.tutpro.baresip.plus/app/src/main/cpp/../../../../distribution.video/g7221/lib/armeabi-v7a/libg722_1.a /home/vagrant/build/com.tutpro.baresip.plus/app/src/main/cpp/../../../../distribution.video/g729/lib/armeabi-v7a/libbcg729.a /home/vagrant/build/com.tutpro.baresip.plus/app/src/main/cpp/../../../../distribution.video/ilbc/lib/armeabi-v7a/libilbc.a /home/vagrant/build/com.tutpro.baresip.plus/app/src/main/cpp/../../../../distribution.video/amr/lib/armeabi-v7a/libamrnb.a /home/vagrant/build/com.tutpro.baresip.plus/app/src/main/cpp/../../../../distribution.video/amr/lib/armeabi-v7a/libamrwb.a /home/vagrant/build/com.tutpro.baresip.plus/app/src/main/cpp/../../../../distribution.video/amr/lib/armeabi-v7a/libamrwbenc.a /home/vagrant/build/com.tutpro.baresip.plus/app/src/main/cpp/../../../../distribution.video/webrtc/lib/armeabi-v7a/libwebrtc.a /home/vagrant/build/com.tutpro.baresip.plus/app/src/main/cpp/../../../../distribution.video/zrtp/lib/armeabi-v7a/libzrtp.a /home/vagrant/build/com.tutpro.baresip.plus/app/src/main/cpp/../../../../distribution.video/bn/lib/armeabi-v7a/libbn.a -lz -llog -lcamera2ndk /home/vagrant/build/com.tutpro.baresip.plus/app/src/main/cpp/../../../../distribution.video/cpu_features/lib/armeabi-v7a/libcpu_features.a /home/vagrant/build/com.tutpro.baresip.plus/app/src/main/cpp/../../../../distribution.video/cpu_features/lib/armeabi-v7a/libndk_compat.a -lmediandk -latomic -lm && :
  /home/vagrant/build/com.tutpro.baresip.plus/app/src/main/cpp/baresip.c:591: error: undefined reference to 'ua_aor'
  clang: error: linker command failed with exit code 1 (use -v to see invocation)
  ninja: build stopped: subcommand failed.
  


* Try:
Run with --stacktrace option to get the stack trace. Run with --info or --debug option to get more log output. Run with --scan to get full insights.

* Get more help at https://help.gradle.org

BUILD FAILED in 17s
15 actionable tasks: 15 executed
==== detail end ====