Difference between revisions of "de.markusfisch.android.binaryeye/lastbuild 86"

From F-Droid
Jump to: navigation, search
(Build log)
(Build log)
 
Line 1: Line 1:
* build session started at 2021-10-06 12:34:56Z
+
* build session started at 2021-10-09 10:06:39Z
* this build started at 2021-10-07 17:04:58Z
+
* this build started at 2021-10-09 17:40:28Z
* this build completed at 2021-10-07 17:10:04Z
+
* this build completed at 2021-10-09 17:47:24Z
* fdroiddata: [https://gitlab.com/fdroid/fdroiddata/commit/9b7a00a2d0b0ffc5891262fa1bdf68361c56dc18 9b7a00a2d0b0ffc5891262fa1bdf68361c56dc18]
+
* fdroiddata: [https://gitlab.com/fdroid/fdroiddata/commit/57bd1eaa7958fdebc5fa2727bac84aabfc21e970 57bd1eaa7958fdebc5fa2727bac84aabfc21e970]
 
* fdroidserverid: [https://gitlab.com/fdroid/fdroidserver/commit/bd079c9311737094e441e9a3e19f8841e9825b89 bd079c9311737094e441e9a3e19f8841e9825b89]
 
* fdroidserverid: [https://gitlab.com/fdroid/fdroidserver/commit/bd079c9311737094e441e9a3e19f8841e9825b89 bd079c9311737094e441e9a3e19f8841e9825b89]
  
Line 9: Line 9:
 
== Installed Android Tools ==
 
== Installed Android Tools ==
  
 +
* build-tools/19.1.0 (19.1)
 +
* build-tools/20.0.0 (20)
 +
* build-tools/21.1.2 (21.1.2)
 +
* build-tools/22.0.1 (22.0.1)
 +
* build-tools/23.0.1 (23.0.1)
 +
* build-tools/23.0.2 (23.0.2)
 +
* build-tools/23.0.3 (23.0.3)
 +
* build-tools/24.0.0 (24)
 +
* build-tools/24.0.1 (24.0.1)
 +
* build-tools/24.0.2 (24.0.2)
 +
* build-tools/24.0.3 (24.0.3)
 +
* build-tools/25.0.0 (25)
 +
* build-tools/25.0.1 (25.0.1)
 +
* build-tools/25.0.2 (25.0.2)
 +
* build-tools/25.0.3 (25.0.3)
 +
* build-tools/26.0.0 (26)
 +
* build-tools/26.0.1 (26.0.1)
 +
* build-tools/26.0.2 (26.0.2)
 +
* build-tools/26.0.3 (26.0.3)
 +
* build-tools/27.0.0 (27)
 +
* build-tools/27.0.1 (27.0.1)
 +
* build-tools/27.0.2 (27.0.2)
 +
* build-tools/27.0.3 (27.0.3)
 +
* build-tools/28.0.0 (28)
 +
* build-tools/28.0.1 (28.0.1)
 +
* build-tools/28.0.2 (28.0.2)
 +
* build-tools/28.0.3 (28.0.3)
 +
* build-tools/29.0.2 (29.0.2)
 +
* build-tools/29.0.3 (29.0.3)
 +
* extras/android/m2repository (47.0.0)
 +
* extras/m2repository/com/android/support/constraint/constraint-layout-solver/1.0.1 (1)
 +
* extras/m2repository/com/android/support/constraint/constraint-layout-solver/1.0.2 (1)
 +
* extras/m2repository/com/android/support/constraint/constraint-layout/1.0.1 (1)
 +
* extras/m2repository/com/android/support/constraint/constraint-layout/1.0.2 (1)
 +
* ndk/21.4.7075529 (21.4.7075529)
 +
* ndk/22.1.7171670 (22.1.7171670)
 +
* platform-tools (29.0.6)
 +
* platforms/android-10 (2)
 +
* platforms/android-11 (2)
 +
* platforms/android-12 (3)
 +
* platforms/android-13 (1)
 +
* platforms/android-14 (4)
 +
* platforms/android-15 (5)
 +
* platforms/android-16 (5)
 +
* platforms/android-17 (3)
 +
* platforms/android-18 (3)
 +
* platforms/android-19 (4)
 +
* platforms/android-20 (2)
 +
* platforms/android-21 (2)
 +
* platforms/android-22 (2)
 +
* platforms/android-23 (3)
 +
* platforms/android-24 (2)
 +
* platforms/android-25 (3)
 +
* platforms/android-26 (2)
 +
* platforms/android-27 (3)
 +
* platforms/android-28 (6)
 +
* platforms/android-29 (4)
 +
* platforms/android-7 (3)
 +
* platforms/android-8 (3)
 +
* platforms/android-9 (2)
 +
* r21e (None)
 +
* r22b (None)
 +
* tools (25.2.5)
  
  
 
== Build Log ==
 
== Build Log ==
  
'Build.py failed on server for de.markusfisch.android.binaryeye:1.45.0'
+
Build succeeded
=detail=
+
<pre>
+
== Installed Android Tools ==
+
 
+
2021-10-07 17:08:55,473 DEBUG: Reading 'config.yml'
+
2021-10-07 17:08:55,485 INFO: Using /opt/android-sdk/build-tools/29.0.3/apksigner
+
2021-10-07 17:08:55,487 INFO: Creating log directory
+
2021-10-07 17:08:55,488 INFO: Creating temporary directory
+
2021-10-07 17:08:55,488 INFO: Creating output directory
+
2021-10-07 17:08:55,511 DEBUG: Getting git vcs interface for https://github.com/markusfisch/BinaryEye
+
2021-10-07 17:08:55,511 DEBUG: > git --version
+
git version 2.11.0
+
2021-10-07 17:08:55,722 INFO: Using git version 2.11.0
+
2021-10-07 17:08:55,722 DEBUG: Checking 1.45.0
+
2021-10-07 17:08:55,722 INFO: Building version 1.45.0 (86) of de.markusfisch.android.binaryeye
+
2021-10-07 17:08:55,723 INFO: Running 'sudo' commands in /home/vagrant
+
2021-10-07 17:08:55,723 DEBUG: > sudo DEBIAN_FRONTEND=noninteractive bash -x -c apt-get update || apt-get update && apt-get install -y --no-install-recommends libc++1-7
+
+ apt-get update
+
Ign:1 http://deb.debian.org/debian stretch InRelease
+
Get:2 http://security.debian.org/debian-security stretch/updates InRelease [53.0 kB]
+
Hit:3 http://deb.debian.org/debian stretch-updates InRelease
+
Get:4 http://deb.debian.org/debian stretch-backports-sloppy InRelease [46.7 kB]
+
Get:5 http://deb.debian.org/debian stretch-backports InRelease [91.8 kB]
+
Get:6 http://deb.debian.org/debian testing InRelease [128 kB]
+
Hit:7 http://deb.debian.org/debian stretch Release
+
Get:8 http://deb.debian.org/debian testing/main i386 Packages.diff/Index [63.6 kB]
+
Get:10 http://deb.debian.org/debian testing/main amd64 Packages.diff/Index [63.6 kB]
+
Get:11 http://deb.debian.org/debian testing/main Translation-en.diff/Index [63.6 kB]
+
Get:12 http://deb.debian.org/debian testing/main i386 Packages T-2021-10-07-1402.32-F-2021-10-06-1401.27.pdiff [32.2 kB]
+
Get:12 http://deb.debian.org/debian testing/main i386 Packages T-2021-10-07-1402.32-F-2021-10-06-1401.27.pdiff [32.2 kB]
+
Get:13 http://deb.debian.org/debian testing/main amd64 Packages T-2021-10-07-1402.32-F-2021-10-06-1401.27.pdiff [33.1 kB]
+
Get:13 http://deb.debian.org/debian testing/main amd64 Packages T-2021-10-07-1402.32-F-2021-10-06-1401.27.pdiff [33.1 kB]
+
Get:14 http://deb.debian.org/debian testing/main Translation-en T-2021-10-07-1402.32-F-2021-10-06-1401.27.pdiff [2,995 B]
+
Get:14 http://deb.debian.org/debian testing/main Translation-en T-2021-10-07-1402.32-F-2021-10-06-1401.27.pdiff [2,995 B]
+
Fetched 579 kB in 4s (125 kB/s)
+
Reading package lists...
+
+ apt-get install -y --no-install-recommends libc++1-7
+
Reading package lists...
+
Building dependency tree...
+
Reading state information...
+
The following additional packages will be installed:
+
  libc++abi1-7
+
Suggested packages:
+
  clang
+
The following NEW packages will be installed:
+
  libc++1-7 libc++abi1-7
+
0 upgraded, 2 newly installed, 0 to remove and 2 not upgraded.
+
Need to get 1,106 kB of archives.
+
After this operation, 5,967 kB of additional disk space will be used.
+
Get:1 http://security.debian.org/debian-security stretch/updates/main amd64 libc++abi1-7 amd64 1:7.0.1-8~deb9u4 [235 kB]
+
Get:2 http://security.debian.org/debian-security stretch/updates/main amd64 libc++1-7 amd64 1:7.0.1-8~deb9u4 [871 kB]
+
Fetched 1,106 kB in 0s (20.2 MB/s)
+
Selecting previously unselected package libc++abi1-7:amd64.
+
(Reading database ... 64914 files and directories currently installed.)
+
Preparing to unpack .../libc++abi1-7_1%3a7.0.1-8~deb9u4_amd64.deb ...
+
Unpacking libc++abi1-7:amd64 (1:7.0.1-8~deb9u4) ...
+
Selecting previously unselected package libc++1-7:amd64.
+
Preparing to unpack .../libc++1-7_1%3a7.0.1-8~deb9u4_amd64.deb ...
+
Unpacking libc++1-7:amd64 (1:7.0.1-8~deb9u4) ...
+
Setting up libc++abi1-7:amd64 (1:7.0.1-8~deb9u4) ...
+
Setting up libc++1-7:amd64 (1:7.0.1-8~deb9u4) ...
+
Processing triggers for libc-bin (2.24-11+deb9u4) ...
+
2021-10-07 17:09:04,958 DEBUG: > sudo passwd --lock root
+
passwd: password expiry information changed.
+
2021-10-07 17:09:05,162 DEBUG: > sudo SUDO_FORCE_REMOVE=yes dpkg --purge sudo
+
(Reading database ... 64934 files and directories currently installed.)
+
Removing sudo (1.8.19p1-2.1+deb9u3) ...
+
Purging configuration files for sudo (1.8.19p1-2.1+deb9u3) ...
+
Processing triggers for systemd (232-25+deb9u13) ...
+
2021-10-07 17:09:08,312 INFO: Getting source for revision c88d5cf4cd66cf70e4c4f0a859cf24e2a114d7a7
+
2021-10-07 17:09:08,313 DEBUG: Directory: build/de.markusfisch.android.binaryeye
+
2021-10-07 17:09:08,313 DEBUG: > git rev-parse --show-toplevel
+
2021-10-07 17:09:08,519 DEBUG: Directory: build/de.markusfisch.android.binaryeye
+
2021-10-07 17:09:08,520 DEBUG: > git submodule foreach --recursive git reset --hard
+
2021-10-07 17:09:08,628 DEBUG: Directory: build/de.markusfisch.android.binaryeye
+
2021-10-07 17:09:08,629 DEBUG: > git reset --hard
+
2021-10-07 17:09:08,837 DEBUG: Directory: build/de.markusfisch.android.binaryeye
+
2021-10-07 17:09:08,838 DEBUG: > git submodule foreach --recursive git clean -dffx
+
2021-10-07 17:09:08,943 DEBUG: Directory: build/de.markusfisch.android.binaryeye
+
2021-10-07 17:09:08,944 DEBUG: > git clean -dffx
+
2021-10-07 17:09:09,049 DEBUG: Directory: build/de.markusfisch.android.binaryeye
+
2021-10-07 17:09:09,049 DEBUG: > git -c core.askpass=/bin/true -c core.sshCommand=/bin/false -c url.https://.insteadOf=ssh:// -c url.https://u:p@bitbucket.org/.insteadOf=git@bitbucket.org: -c url.https://u:p@bitbucket.org.insteadOf=git://bitbucket.org -c url.https://u:p@bitbucket.org.insteadOf=https://bitbucket.org -c url.https://u:p@github.com/.insteadOf=git@github.com: -c url.https://u:p@github.com.insteadOf=git://github.com -c url.https://u:p@github.com.insteadOf=https://github.com -c url.https://u:p@gitlab.com/.insteadOf=git@gitlab.com: -c url.https://u:p@gitlab.com.insteadOf=git://gitlab.com -c url.https://u:p@gitlab.com.insteadOf=https://gitlab.com fetch origin
+
2021-10-07 17:09:09,357 DEBUG: Directory: build/de.markusfisch.android.binaryeye
+
2021-10-07 17:09:09,357 DEBUG: > git -c core.askpass=/bin/true -c core.sshCommand=/bin/false -c url.https://.insteadOf=ssh:// -c url.https://u:p@bitbucket.org/.insteadOf=git@bitbucket.org: -c url.https://u:p@bitbucket.org.insteadOf=git://bitbucket.org -c url.https://u:p@bitbucket.org.insteadOf=https://bitbucket.org -c url.https://u:p@github.com/.insteadOf=git@github.com: -c url.https://u:p@github.com.insteadOf=git://github.com -c url.https://u:p@github.com.insteadOf=https://github.com -c url.https://u:p@gitlab.com/.insteadOf=git@gitlab.com: -c url.https://u:p@gitlab.com.insteadOf=git://gitlab.com -c url.https://u:p@gitlab.com.insteadOf=https://gitlab.com fetch --prune --tags --force origin
+
2021-10-07 17:09:09,663 DEBUG: Directory: build/de.markusfisch.android.binaryeye
+
2021-10-07 17:09:09,664 DEBUG: > git remote set-head origin --auto
+
2021-10-07 17:09:10,072 DEBUG: Directory: build/de.markusfisch.android.binaryeye
+
2021-10-07 17:09:10,072 DEBUG: > git checkout -f c88d5cf4cd66cf70e4c4f0a859cf24e2a114d7a7
+
2021-10-07 17:09:10,280 DEBUG: Directory: build/de.markusfisch.android.binaryeye
+
2021-10-07 17:09:10,280 DEBUG: > git clean -dffx
+
2021-10-07 17:09:10,385 INFO: Creating local.properties file at build/de.markusfisch.android.binaryeye/local.properties
+
2021-10-07 17:09:10,386 INFO: Creating local.properties file at build/de.markusfisch.android.binaryeye/app/local.properties
+
2021-10-07 17:09:10,386 DEBUG: Removing debuggable flags from build/de.markusfisch.android.binaryeye/app
+
2021-10-07 17:09:10,394 INFO: Cleaned build.gradle of keysigning configs at build/de.markusfisch.android.binaryeye/app/build.gradle
+
2021-10-07 17:09:10,405 INFO: Cleaning Gradle project...
+
2021-10-07 17:09:10,406 DEBUG: Directory: build/de.markusfisch.android.binaryeye/app
+
2021-10-07 17:09:10,406 DEBUG: > /home/vagrant/fdroidserver/gradlew-fdroid clean
+
Found 7.0.2 via distributionUrl
+
Running /opt/gradle/versions/7.0.2/bin/gradle clean
+
 
+
Welcome to Gradle 7.0.2!
+
 
+
Here are the highlights of this release:
+
- File system watching enabled by default
+
- Support for running with and building Java 16 projects
+
- Native support for Apple Silicon processors
+
- Dependency catalog feature preview
+
 
+
For more details see https://docs.gradle.org/7.0.2/release-notes.html
+
 
+
To honour the JVM settings for this build a single-use Daemon process will be forked. See https://docs.gradle.org/7.0.2/userguide/gradle_daemon.html#sec:disabling_the_daemon.
+
Daemon will be stopped at the end of the build
+
 
+
FAILURE: Build failed with an exception.
+
 
+
* Where:
+
Build file '/home/vagrant/build/de.markusfisch.android.binaryeye/app/build.gradle' line: 1
+
 
+
* What went wrong:
+
A problem occurred evaluating project ':app'.
+
> Failed to apply plugin 'com.android.internal.application'.
+
  > Android Gradle plugin requires Java 11 to run. You are currently using Java 1.8.
+
    You can try some of the following options:
+
      - changing the IDE settings.
+
      - changing the JAVA_HOME environment variable.
+
      - changing `org.gradle.java.home` in `gradle.properties`.
+
 
+
* Try:
+
Run with --stacktrace option to get the stack trace. Run with --info or --debug option to get more log output. Run with --scan to get full insights.
+
 
+
* Get more help at https://help.gradle.org
+
 
+
BUILD FAILED in 27s
+
2021-10-07 17:09:39,271 ERROR: Could not build app de.markusfisch.android.binaryeye: Error cleaning de.markusfisch.android.binaryeye:1.45.0
+
==== detail begin ====
+
Found 7.0.2 via distributionUrl
+
Running /opt/gradle/versions/7.0.2/bin/gradle clean
+
 
+
Welcome to Gradle 7.0.2!
+
 
+
Here are the highlights of this release:
+
- File system watching enabled by default
+
- Support for running with and building Java 16 projects
+
- Native support for Apple Silicon processors
+
- Dependency catalog feature preview
+
 
+
For more details see https://docs.gradle.org/7.0.2/release-notes.html
+
 
+
To honour the JVM settings for this build a single-use Daemon process will be forked. See https://docs.gradle.org/7.0.2/userguide/gradle_daemon.html#sec:disabling_the_daemon.
+
Daemon will be stopped at the end of the build
+
 
+
FAILURE: Build failed with an exception.
+
 
+
* Where:
+
Build file '/home/vagrant/build/de.markusfisch.android.binaryeye/app/build.gradle' line: 1
+
 
+
* What went wrong:
+
A problem occurred evaluating project ':app'.
+
> Failed to apply plugin 'com.android.internal.application'.
+
  > Android Gradle plugin requires Java 11 to run. You are currently using Java 1.8.
+
    You can try some of the following options:
+
      - changing the IDE settings.
+
      - changing the JAVA_HOME environment variable.
+
      - changing `org.gradle.java.home` in `gradle.properties`.
+
 
+
* Try:
+
Run with --stacktrace option to get the stack trace. Run with --info or --debug option to get more log output. Run with --scan to get full insights.
+
 
+
* Get more help at https://help.gradle.org
+
 
+
BUILD FAILED in 27s
+
==== detail end ====
+
2021-10-07 17:09:39,272 DEBUG: Error encoutered, stopping by user request.
+
</pre>
+

Latest revision as of 17:47, 9 October 2021

Installed Android Tools

  • build-tools/19.1.0 (19.1)
  • build-tools/20.0.0 (20)
  • build-tools/21.1.2 (21.1.2)
  • build-tools/22.0.1 (22.0.1)
  • build-tools/23.0.1 (23.0.1)
  • build-tools/23.0.2 (23.0.2)
  • build-tools/23.0.3 (23.0.3)
  • build-tools/24.0.0 (24)
  • build-tools/24.0.1 (24.0.1)
  • build-tools/24.0.2 (24.0.2)
  • build-tools/24.0.3 (24.0.3)
  • build-tools/25.0.0 (25)
  • build-tools/25.0.1 (25.0.1)
  • build-tools/25.0.2 (25.0.2)
  • build-tools/25.0.3 (25.0.3)
  • build-tools/26.0.0 (26)
  • build-tools/26.0.1 (26.0.1)
  • build-tools/26.0.2 (26.0.2)
  • build-tools/26.0.3 (26.0.3)
  • build-tools/27.0.0 (27)
  • build-tools/27.0.1 (27.0.1)
  • build-tools/27.0.2 (27.0.2)
  • build-tools/27.0.3 (27.0.3)
  • build-tools/28.0.0 (28)
  • build-tools/28.0.1 (28.0.1)
  • build-tools/28.0.2 (28.0.2)
  • build-tools/28.0.3 (28.0.3)
  • build-tools/29.0.2 (29.0.2)
  • build-tools/29.0.3 (29.0.3)
  • extras/android/m2repository (47.0.0)
  • extras/m2repository/com/android/support/constraint/constraint-layout-solver/1.0.1 (1)
  • extras/m2repository/com/android/support/constraint/constraint-layout-solver/1.0.2 (1)
  • extras/m2repository/com/android/support/constraint/constraint-layout/1.0.1 (1)
  • extras/m2repository/com/android/support/constraint/constraint-layout/1.0.2 (1)
  • ndk/21.4.7075529 (21.4.7075529)
  • ndk/22.1.7171670 (22.1.7171670)
  • platform-tools (29.0.6)
  • platforms/android-10 (2)
  • platforms/android-11 (2)
  • platforms/android-12 (3)
  • platforms/android-13 (1)
  • platforms/android-14 (4)
  • platforms/android-15 (5)
  • platforms/android-16 (5)
  • platforms/android-17 (3)
  • platforms/android-18 (3)
  • platforms/android-19 (4)
  • platforms/android-20 (2)
  • platforms/android-21 (2)
  • platforms/android-22 (2)
  • platforms/android-23 (3)
  • platforms/android-24 (2)
  • platforms/android-25 (3)
  • platforms/android-26 (2)
  • platforms/android-27 (3)
  • platforms/android-28 (6)
  • platforms/android-29 (4)
  • platforms/android-7 (3)
  • platforms/android-8 (3)
  • platforms/android-9 (2)
  • r21e (None)
  • r22b (None)
  • tools (25.2.5)


Build Log

Build succeeded