Difference between revisions of "de.westnordost.streetcomplete/lastbuild 2501"

From F-Droid
Jump to: navigation, search
(Build log)
(Build log)
Line 1: Line 1:
* build session started at 2020-10-27 11:14:56Z
+
* build session started at 2020-10-28 07:00:12Z
* this build started at 2020-10-27 11:52:00Z
+
* this build started at 2020-10-28 11:37:14Z
* this build completed at 2020-10-27 11:52:47Z
+
* this build completed at 2020-10-28 11:40:04Z
* fdroiddata: [https://gitlab.com/fdroid/fdroiddata/commit/0ab5d3fda8e7f9c59b4db569c159d41ba34fed8c 0ab5d3fda8e7f9c59b4db569c159d41ba34fed8c]
+
* fdroiddata: [https://gitlab.com/fdroid/fdroiddata/commit/b2e64f56dd743efbd24bf72cf3d58663a88f2bd9 b2e64f56dd743efbd24bf72cf3d58663a88f2bd9]
 
* fdroidserverid: [https://gitlab.com/fdroid/fdroidserver/commit/1f7228d53859f078698468b2e0bbe48485e4ece7 1f7228d53859f078698468b2e0bbe48485e4ece7]
 
* fdroidserverid: [https://gitlab.com/fdroid/fdroidserver/commit/1f7228d53859f078698468b2e0bbe48485e4ece7 1f7228d53859f078698468b2e0bbe48485e4ece7]
 +
 +
* buildserverid: [https://gitlab.com/fdroid/fdroidserver/commit/06766ba48b079e2e8a13af15bf1cfbdb38365ca5 06766ba48b079e2e8a13af15bf1cfbdb38365ca5]
  
 
== Installed Android Tools ==
 
== Installed Android Tools ==
Line 11: Line 13:
 
== Build Log ==
 
== Build Log ==
  
"could not bring up vm 'builder_default'"
+
'Build.py failed on server for de.westnordost.streetcomplete:25.1'
 +
=detail=
 +
<pre>
 +
== Installed Android Tools ==
 +
 
 +
2020-10-28 11:38:11,094 INFO: Creating log directory
 +
2020-10-28 11:38:11,094 INFO: Creating temporary directory
 +
2020-10-28 11:38:11,094 INFO: Creating output directory
 +
2020-10-28 11:38:14,476 INFO: Using git version 2.11.0
 +
2020-10-28 11:38:14,476 INFO: Building version 25.1 (2501) of de.westnordost.streetcomplete
 +
2020-10-28 11:38:17,911 INFO: Getting source for revision v25.1
 +
2020-10-28 11:38:20,669 INFO: Creating local.properties file at build/de.westnordost.streetcomplete/local.properties
 +
2020-10-28 11:38:20,670 INFO: Creating local.properties file at build/de.westnordost.streetcomplete/app/local.properties
 +
2020-10-28 11:38:20,691 INFO: Cleaned build.gradle.kts of keysigning configs at build/de.westnordost.streetcomplete/app/build.gradle.kts
 +
2020-10-28 11:38:20,711 INFO: Cleaning Gradle project...
 +
2020-10-28 11:39:41,112 ERROR: Could not build app de.westnordost.streetcomplete: Error cleaning de.westnordost.streetcomplete:25.1
 +
==== detail begin ====
 +
Found 6.6 via distributionUrl
 +
Downloading missing gradle version 6.6
 +
/home/vagrant/.cache/fdroidserver/gradle-6.6-bin.zip: OK
 +
Running /opt/gradle/versions/6.6/bin/gradle clean
 +
 
 +
Welcome to Gradle 6.6!
 +
 
 +
Here are the highlights of this release:
 +
- Experimental build configuration caching
 +
- Built-in conventions for handling credentials
 +
- Java compilation supports --release flag
 +
 
 +
For more details see https://docs.gradle.org/6.6/release-notes.html
 +
 
 +
To honour the JVM settings for this build a new JVM will be forked. Please consider using the daemon: https://docs.gradle.org/6.6/userguide/gradle_daemon.html.
 +
Daemon will be stopped at the end of the build stopping after processing
 +
 
 +
> Task :buildSrc:compileKotlin
 +
The `kotlin-dsl` plugin applied to project ':buildSrc' enables experimental Kotlin compiler features. For more information see https://docs.gradle.org/6.6/userguide/kotlin_dsl.html#sec:kotlin-dsl_plugin
 +
w: /home/vagrant/build/de.westnordost.streetcomplete/buildSrc/src/main/java/GenerateMetadataByCountry.kt: (39, 59): Unchecked cast: Any! to Map<String, Any>
 +
w: /home/vagrant/build/de.westnordost.streetcomplete/buildSrc/src/main/java/UpdatePresetsTask.kt: (50, 83): Unchecked cast: Any to JsonArray<JsonObject>
 +
 
 +
> Task :buildSrc:compileJava NO-SOURCE
 +
> Task :buildSrc:compileGroovy NO-SOURCE
 +
> Task :buildSrc:pluginDescriptors
 +
> Task :buildSrc:processResources NO-SOURCE
 +
> Task :buildSrc:classes UP-TO-DATE
 +
> Task :buildSrc:inspectClassesForKotlinIC
 +
 
 +
> Task :buildSrc:jar
 +
:jar: No valid plugin descriptors were found in META-INF/gradle-plugins
 +
 
 +
> Task :buildSrc:assemble
 +
> Task :buildSrc:compileTestKotlin NO-SOURCE
 +
> Task :buildSrc:pluginUnderTestMetadata
 +
> Task :buildSrc:compileTestJava NO-SOURCE
 +
> Task :buildSrc:compileTestGroovy NO-SOURCE
 +
> Task :buildSrc:processTestResources NO-SOURCE
 +
> Task :buildSrc:testClasses UP-TO-DATE
 +
> Task :buildSrc:test NO-SOURCE
 +
> Task :buildSrc:validatePlugins
 +
> Task :buildSrc:check
 +
> Task :buildSrc:build
 +
 
 +
> Configure project :app
 +
e: /home/vagrant/build/de.westnordost.streetcomplete/app/build.gradle.kts:65:5: Unresolved reference: releaseSigningConfig
 +
e: /home/vagrant/build/de.westnordost.streetcomplete/app/build.gradle.kts:66:5: Unresolved reference: releaseSigningConfig
 +
e: /home/vagrant/build/de.westnordost.streetcomplete/app/build.gradle.kts:67:5: Unresolved reference: releaseSigningConfig
 +
e: /home/vagrant/build/de.westnordost.streetcomplete/app/build.gradle.kts:68:5: Unresolved reference: releaseSigningConfig
 +
 
 +
FAILURE: Build failed with an exception.
 +
 
 +
* Where:
 +
Build file '/home/vagrant/build/de.westnordost.streetcomplete/app/build.gradle.kts' line: 65
 +
 
 +
* What went wrong:
 +
Script compilation errors:
 +
 
 +
  Line 65:    releaseSigningConfig.storeFile = file(props.getProperty("storeFile"))
 +
              ^ Unresolved reference: releaseSigningConfig
 +
 
 +
  Line 66:    releaseSigningConfig.storePassword = props.getProperty("storePassword")
 +
              ^ Unresolved reference: releaseSigningConfig
 +
 
 +
  Line 67:    releaseSigningConfig.keyAlias = props.getProperty("keyAlias")
 +
              ^ Unresolved reference: releaseSigningConfig
 +
 
 +
  Line 68:    releaseSigningConfig.keyPassword = props.getProperty("keyPassword")
 +
              ^ Unresolved reference: releaseSigningConfig
 +
 
 +
4 errors
 +
 
 +
* Try:
 +
Run with --stacktrace option to get the stack trace. Run with --info or --debug option to get more log output. Run with --scan to get full insights.
 +
 
 +
* Get more help at https://help.gradle.org
 +
 
 +
BUILD FAILED in 1m 17s
 +
==== detail end ====
 +
</pre>

Revision as of 11:40, 28 October 2020

Installed Android Tools

Build Log

'Build.py failed on server for de.westnordost.streetcomplete:25.1'

detail

== Installed Android Tools ==

2020-10-28 11:38:11,094 INFO: Creating log directory
2020-10-28 11:38:11,094 INFO: Creating temporary directory
2020-10-28 11:38:11,094 INFO: Creating output directory
2020-10-28 11:38:14,476 INFO: Using git version 2.11.0
2020-10-28 11:38:14,476 INFO: Building version 25.1 (2501) of de.westnordost.streetcomplete
2020-10-28 11:38:17,911 INFO: Getting source for revision v25.1
2020-10-28 11:38:20,669 INFO: Creating local.properties file at build/de.westnordost.streetcomplete/local.properties
2020-10-28 11:38:20,670 INFO: Creating local.properties file at build/de.westnordost.streetcomplete/app/local.properties
2020-10-28 11:38:20,691 INFO: Cleaned build.gradle.kts of keysigning configs at build/de.westnordost.streetcomplete/app/build.gradle.kts
2020-10-28 11:38:20,711 INFO: Cleaning Gradle project...
2020-10-28 11:39:41,112 ERROR: Could not build app de.westnordost.streetcomplete: Error cleaning de.westnordost.streetcomplete:25.1
==== detail begin ====
Found 6.6 via distributionUrl
Downloading missing gradle version 6.6
/home/vagrant/.cache/fdroidserver/gradle-6.6-bin.zip: OK
Running /opt/gradle/versions/6.6/bin/gradle clean

Welcome to Gradle 6.6!

Here are the highlights of this release:
 - Experimental build configuration caching
 - Built-in conventions for handling credentials
 - Java compilation supports --release flag

For more details see https://docs.gradle.org/6.6/release-notes.html

To honour the JVM settings for this build a new JVM will be forked. Please consider using the daemon: https://docs.gradle.org/6.6/userguide/gradle_daemon.html.
Daemon will be stopped at the end of the build stopping after processing

> Task :buildSrc:compileKotlin
The `kotlin-dsl` plugin applied to project ':buildSrc' enables experimental Kotlin compiler features. For more information see https://docs.gradle.org/6.6/userguide/kotlin_dsl.html#sec:kotlin-dsl_plugin
w: /home/vagrant/build/de.westnordost.streetcomplete/buildSrc/src/main/java/GenerateMetadataByCountry.kt: (39, 59): Unchecked cast: Any! to Map<String, Any>
w: /home/vagrant/build/de.westnordost.streetcomplete/buildSrc/src/main/java/UpdatePresetsTask.kt: (50, 83): Unchecked cast: Any to JsonArray<JsonObject>

> Task :buildSrc:compileJava NO-SOURCE
> Task :buildSrc:compileGroovy NO-SOURCE
> Task :buildSrc:pluginDescriptors
> Task :buildSrc:processResources NO-SOURCE
> Task :buildSrc:classes UP-TO-DATE
> Task :buildSrc:inspectClassesForKotlinIC

> Task :buildSrc:jar
:jar: No valid plugin descriptors were found in META-INF/gradle-plugins

> Task :buildSrc:assemble
> Task :buildSrc:compileTestKotlin NO-SOURCE
> Task :buildSrc:pluginUnderTestMetadata
> Task :buildSrc:compileTestJava NO-SOURCE
> Task :buildSrc:compileTestGroovy NO-SOURCE
> Task :buildSrc:processTestResources NO-SOURCE
> Task :buildSrc:testClasses UP-TO-DATE
> Task :buildSrc:test NO-SOURCE
> Task :buildSrc:validatePlugins
> Task :buildSrc:check
> Task :buildSrc:build

> Configure project :app
e: /home/vagrant/build/de.westnordost.streetcomplete/app/build.gradle.kts:65:5: Unresolved reference: releaseSigningConfig
e: /home/vagrant/build/de.westnordost.streetcomplete/app/build.gradle.kts:66:5: Unresolved reference: releaseSigningConfig
e: /home/vagrant/build/de.westnordost.streetcomplete/app/build.gradle.kts:67:5: Unresolved reference: releaseSigningConfig
e: /home/vagrant/build/de.westnordost.streetcomplete/app/build.gradle.kts:68:5: Unresolved reference: releaseSigningConfig

FAILURE: Build failed with an exception.

* Where:
Build file '/home/vagrant/build/de.westnordost.streetcomplete/app/build.gradle.kts' line: 65

* What went wrong:
Script compilation errors:

  Line 65:     releaseSigningConfig.storeFile = file(props.getProperty("storeFile"))
               ^ Unresolved reference: releaseSigningConfig

  Line 66:     releaseSigningConfig.storePassword = props.getProperty("storePassword")
               ^ Unresolved reference: releaseSigningConfig

  Line 67:     releaseSigningConfig.keyAlias = props.getProperty("keyAlias")
               ^ Unresolved reference: releaseSigningConfig

  Line 68:     releaseSigningConfig.keyPassword = props.getProperty("keyPassword")
               ^ Unresolved reference: releaseSigningConfig

4 errors

* Try:
Run with --stacktrace option to get the stack trace. Run with --info or --debug option to get more log output. Run with --scan to get full insights.

* Get more help at https://help.gradle.org

BUILD FAILED in 1m 17s
==== detail end ====