is.xyz.mpv/lastbuild 25

From F-Droid
Revision as of 06:58, 16 October 2021 by Robot (Talk | contribs) (Build log)

Jump to: navigation, search

Installed Android Tools

Build Log

'Build.py failed on server for is.xyz.mpv:2021-10-10-release'

detail

[...]
zz-testcase-minimized-hb-draw-fuzzer-5686960406659072
2021-10-16 06:57:24,749 WARNING: Found binary at buildscripts/deps/harfbuzz/test/fuzzing/fonts/clusterfuzz-testcase-minimized-harfbuzz_fuzzer-5093685255077888
2021-10-16 06:57:24,749 WARNING: Found binary at buildscripts/deps/harfbuzz/test/fuzzing/fonts/clusterfuzz-testcase-minimized-hb-subset-fuzzer-5640452927127552
2021-10-16 06:57:24,750 WARNING: Found binary at buildscripts/deps/harfbuzz/test/fuzzing/fonts/clusterfuzz-testcase-minimized-hb-fuzzer-5700697074958336
2021-10-16 06:57:24,750 WARNING: Found binary at buildscripts/deps/harfbuzz/test/fuzzing/fonts/clusterfuzz-testcase-minimized-hb-subset-fuzzer-5609112151916544
2021-10-16 06:57:24,750 WARNING: Found binary at buildscripts/deps/harfbuzz/test/fuzzing/fonts/clusterfuzz-testcase-hb-fuzzer-5662671558934528
2021-10-16 06:57:24,750 WARNING: Found binary at buildscripts/deps/harfbuzz/test/fuzzing/fonts/clusterfuzz-testcase-minimized-hb-fuzzer-6111685556305920
2021-10-16 06:57:24,750 WARNING: Found binary at buildscripts/deps/harfbuzz/test/fuzzing/fonts/clusterfuzz-testcase-minimized-hb-subset-fuzzer-5759783999635456
2021-10-16 06:57:24,750 WARNING: Found binary at buildscripts/deps/harfbuzz/test/fuzzing/fonts/clusterfuzz-testcase-hb-subset-fuzzer-5643036478930944
2021-10-16 06:57:24,751 WARNING: Found binary at buildscripts/deps/harfbuzz/test/fuzzing/fonts/clusterfuzz-testcase-minimized-hb-fuzzer-5617496443846656
2021-10-16 06:57:24,751 WARNING: Found binary at buildscripts/deps/harfbuzz/test/fuzzing/fonts/clusterfuzz-testcase-minimized-hb-subset-fuzzer-5743250149736448
2021-10-16 06:57:24,751 WARNING: Found binary at buildscripts/deps/harfbuzz/test/fuzzing/fonts/clusterfuzz-testcase-minimized-hb-fuzzer-5303930168803328
2021-10-16 06:57:24,751 WARNING: Found binary at buildscripts/deps/harfbuzz/test/fuzzing/fonts/clusterfuzz-testcase-minimized-hb-subset-fuzzer-5616763250278400
2021-10-16 06:57:24,751 WARNING: Found binary at buildscripts/deps/harfbuzz/test/fuzzing/fonts/crash-4b60576767ee4d9fe1cc10959d89baf73d4e8249
2021-10-16 06:57:24,751 WARNING: Found binary at buildscripts/deps/harfbuzz/test/fuzzing/fonts/clusterfuzz-testcase-minimized-hb-subset-fuzzer-5695865298092032
2021-10-16 06:57:24,752 WARNING: Found binary at buildscripts/deps/harfbuzz/test/fuzzing/fonts/fuzz-3-harfbuzz_fuzzer
2021-10-16 06:57:24,752 WARNING: Found binary at buildscripts/deps/harfbuzz/test/fuzzing/fonts/a69118c2c2ada48ff803d9149daa54c9ebdae30e
2021-10-16 06:57:24,752 WARNING: Found binary at buildscripts/deps/harfbuzz/test/fuzzing/fonts/clusterfuzz-testcase-minimized-hb-shape-fuzzer-5629524117553152
2021-10-16 06:57:24,752 WARNING: Found binary at buildscripts/deps/harfbuzz/test/fuzzing/fonts/clusterfuzz-testcase-minimized-hb-draw-fuzzer-5103082208493568
2021-10-16 06:57:24,752 WARNING: Found binary at buildscripts/deps/harfbuzz/test/fuzzing/fonts/clusterfuzz-testcase-minimized-harfbuzz_fuzzer-6128803416637440
2021-10-16 06:57:24,752 WARNING: Found binary at buildscripts/deps/harfbuzz/test/fuzzing/fonts/clusterfuzz-testcase-minimized-harfbuzz_fuzzer-5166320261529600
2021-10-16 06:57:24,752 WARNING: Found binary at buildscripts/deps/harfbuzz/test/fuzzing/fonts/clusterfuzz-testcase-minimized-hb-subset-fuzzer-5072358514753536
2021-10-16 06:57:24,753 WARNING: Found binary at buildscripts/deps/harfbuzz/test/fuzzing/fonts/clusterfuzz-testcase-minimized-hb-subset-fuzzer-5660711141769216
2021-10-16 06:57:24,753 WARNING: Found binary at buildscripts/deps/harfbuzz/test/fuzzing/fonts/clusterfuzz-testcase-minimized-hb-shape-fuzzer-5716208469409792
2021-10-16 06:57:24,753 WARNING: Found binary at buildscripts/deps/harfbuzz/test/fuzzing/fonts/clusterfuzz-testcase-minimized-harfbuzz_fuzzer-5973566991106048
2021-10-16 06:57:24,753 WARNING: Found binary at buildscripts/deps/harfbuzz/test/fuzzing/fonts/clusterfuzz-testcase-minimized-hb-subset-fuzzer-5696607199166464
2021-10-16 06:57:24,753 WARNING: Found binary at buildscripts/deps/harfbuzz/test/fuzzing/fonts/clusterfuzz-testcase-hb-subset-fuzzer-5686749313892352
2021-10-16 06:57:24,754 WARNING: Found binary at buildscripts/deps/harfbuzz/test/fuzzing/fonts/clusterfuzz-testcase-minimized-hb-subset-fuzzer-5763024094232576
2021-10-16 06:57:24,754 WARNING: Found binary at buildscripts/deps/harfbuzz/test/fuzzing/fonts/clusterfuzz-testcase-minimized-hb-subset-fuzzer-5667673584697344
2021-10-16 06:57:24,754 WARNING: Found binary at buildscripts/deps/harfbuzz/test/fuzzing/fonts/clusterfuzz-testcase-minimized-hb-shape-fuzzer-5719982789361664
2021-10-16 06:57:24,754 WARNING: Found binary at buildscripts/deps/harfbuzz/test/fuzzing/fonts/clusterfuzz-testcase-minimized-hb-fuzzer-5331901587914752
2021-10-16 06:57:24,754 WARNING: Found binary at buildscripts/deps/harfbuzz/test/fuzzing/fonts/clusterfuzz-testcase-minimized-hb-subset-fuzzer-6543700493598720
2021-10-16 06:57:24,754 WARNING: Found binary at buildscripts/deps/harfbuzz/test/fuzzing/fonts/clusterfuzz-testcase-minimized-harfbuzz_fuzzer-5644474732249088
2021-10-16 06:57:24,755 WARNING: Found binary at buildscripts/deps/harfbuzz/test/fuzzing/fonts/clusterfuzz-testcase-minimized-hb-draw-fuzzer-5681465586352128
2021-10-16 06:57:24,755 WARNING: Found binary at buildscripts/deps/harfbuzz/test/fuzzing/fonts/clusterfuzz-testcase-minimized-hb-subset-fuzzer-5662792105590784
2021-10-16 06:57:24,755 WARNING: Found binary at buildscripts/deps/harfbuzz/test/fuzzing/fonts/clusterfuzz-testcase-minimized-hb-shape-fuzzer-5196560812474368
2021-10-16 06:57:24,755 WARNING: Found binary at buildscripts/deps/harfbuzz/test/fuzzing/fonts/clusterfuzz-testcase-minimized-hb-subset-fuzzer-5650879734874112
2021-10-16 06:57:24,755 WARNING: Found binary at buildscripts/deps/harfbuzz/test/fuzzing/fonts/fuzz-3-harfbuzz_fuzzer(5)
2021-10-16 06:57:24,755 WARNING: Found binary at buildscripts/deps/harfbuzz/test/fuzzing/fonts/clusterfuzz-testcase-minimized-hb-subset-fuzzer-5753173985984512
2021-10-16 06:57:24,755 WARNING: Found binary at buildscripts/deps/harfbuzz/test/fuzzing/fonts/clusterfuzz-testcase-minimized-hb-subset-fuzzer-5345734743031808
2021-10-16 06:57:24,756 WARNING: Found binary at buildscripts/deps/harfbuzz/test/fuzzing/fonts/clusterfuzz-testcase-minimized-hb-shape-fuzzer-5642899625082880
2021-10-16 06:57:24,756 WARNING: Found binary at buildscripts/deps/harfbuzz/test/fuzzing/fonts/clusterfuzz-testcase-minimized-hb-subset-fuzzer-5735719311507456
2021-10-16 06:57:24,756 WARNING: Found binary at buildscripts/deps/harfbuzz/test/fuzzing/fonts/clusterfuzz-testcase-minimized-hb-draw-fuzzer-5088336521986048
2021-10-16 06:57:24,756 WARNING: Found binary at buildscripts/deps/harfbuzz/test/fuzzing/fonts/217a934cfe15c548b572c203dceb2befdf026462
2021-10-16 06:57:24,756 WARNING: Found binary at buildscripts/deps/harfbuzz/test/fuzzing/fonts/clusterfuzz-testcase-minimized-hb-subset-fuzzer-4681956043390976
2021-10-16 06:57:24,756 WARNING: Found binary at buildscripts/deps/harfbuzz/test/fuzzing/fonts/clusterfuzz-testcase-minimized-hb-fuzzer-4769173588672512
2021-10-16 06:57:24,757 WARNING: Found binary at buildscripts/deps/harfbuzz/test/fuzzing/fonts/clusterfuzz-testcase-minimized-hb-subset-fuzzer-5617065093365760
2021-10-16 06:57:24,757 WARNING: Found binary at buildscripts/deps/harfbuzz/test/fuzzing/fonts/clusterfuzz-testcase-minimized-hb-fuzzer-6260579246276608
2021-10-16 06:57:24,757 WARNING: Found binary at buildscripts/deps/harfbuzz/test/fuzzing/fonts/clusterfuzz-testcase-minimized-hb-shape-fuzzer-5061207689134080
2021-10-16 06:57:24,757 WARNING: Found binary at buildscripts/deps/harfbuzz/test/fuzzing/fonts/clusterfuzz-testcase-minimized-hb-shape-fuzzer-5718464350650368
2021-10-16 06:57:24,757 WARNING: Found binary at buildscripts/deps/harfbuzz/test/fuzzing/fonts/clusterfuzz-testcase-minimized-hb-shape-fuzzer-5736657639178240
2021-10-16 06:57:24,757 WARNING: Found binary at buildscripts/deps/harfbuzz/test/fuzzing/fonts/clusterfuzz-testcase-minimized-hb-subset-fuzzer-5675720390475776
2021-10-16 06:57:24,757 WARNING: Found binary at buildscripts/deps/harfbuzz/test/fuzzing/fonts/1a6f1687b7a221f9f2c834b0b360d3c8463b6daf
2021-10-16 06:57:24,758 WARNING: Found binary at buildscripts/deps/harfbuzz/test/fuzzing/fonts/clusterfuzz-testcase-minimized-harfbuzz_fuzzer-4710179695493120
2021-10-16 06:57:24,758 WARNING: Found binary at buildscripts/deps/harfbuzz/test/fuzzing/fonts/clusterfuzz-testcase-minimized-harfbuzz_fuzzer-5754958982021120
2021-10-16 06:57:24,758 WARNING: Found binary at buildscripts/deps/harfbuzz/test/fuzzing/fonts/oom-6ef8c96d3710262511bcc730dce9c00e722cb653
2021-10-16 06:57:24,758 WARNING: Found binary at buildscripts/deps/harfbuzz/test/fuzzing/fonts/clusterfuzz-testcase-minimized-hb-subset-fuzzer-6241118484955136
2021-10-16 06:57:24,758 WARNING: Found binary at buildscripts/deps/harfbuzz/test/fuzzing/fonts/clusterfuzz-testcase-minimized-harfbuzz_fuzzer-5151890782027776
2021-10-16 06:57:24,758 WARNING: Found binary at buildscripts/deps/harfbuzz/test/fuzzing/fonts/clusterfuzz-testcase-minimized-hb-shape-fuzzer-5725129603022848
2021-10-16 06:57:24,758 WARNING: Found binary at buildscripts/deps/harfbuzz/test/fuzzing/fonts/clusterfuzz-testcase-minimized-hb-shape-fuzzer-5718889451749376
2021-10-16 06:57:24,759 WARNING: Found binary at buildscripts/deps/harfbuzz/test/fuzzing/fonts/clusterfuzz-testcase-minimized-hb-fuzzer-4841745322868736
2021-10-16 06:57:24,759 WARNING: Found binary at buildscripts/deps/harfbuzz/test/fuzzing/fonts/clusterfuzz-testcase-minimized-hb-shape-fuzzer-5631444412530688
2021-10-16 06:57:24,759 WARNING: Found binary at buildscripts/deps/harfbuzz/test/fuzzing/fonts/clusterfuzz-testcase-minimized-hb-subset-fuzzer-5680398559870976
2021-10-16 06:57:24,759 WARNING: Found binary at buildscripts/deps/harfbuzz/test/fuzzing/fonts/clusterfuzz-testcase-minimized-hb-subset-fuzzer-5756658848890880
2021-10-16 06:57:24,759 WARNING: Found binary at buildscripts/deps/harfbuzz/test/fuzzing/fonts/clusterfuzz-testcase-minimized-hb-subset-fuzzer-5768186323009536
2021-10-16 06:57:24,759 WARNING: Found binary at buildscripts/deps/harfbuzz/test/fuzzing/fonts/641bd9db850193064d17575053ae2bf8ec149ddc
2021-10-16 06:57:25,156 INFO: Removing binary at buildscripts/deps/mbedtls/programs/fuzz/corpuses/server
2021-10-16 06:57:25,156 INFO: Removing binary at buildscripts/deps/mbedtls/programs/fuzz/corpuses/client
2021-10-16 06:57:25,156 INFO: Removing binary at buildscripts/deps/mbedtls/programs/fuzz/corpuses/dtlsserver
2021-10-16 06:57:25,156 INFO: Removing binary at buildscripts/deps/mbedtls/programs/fuzz/corpuses/dtlsclient
2021-10-16 06:57:25,178 INFO: Removing binary at buildscripts/deps/mbedtls/tests/data_files/hash_file_3
2021-10-16 06:57:25,178 INFO: Removing binary at buildscripts/deps/mbedtls/tests/data_files/hash_file_2
2021-10-16 06:57:25,181 INFO: Removing binary at buildscripts/deps/mbedtls/tests/data_files/hash_file_1
2021-10-16 06:57:25,287 INFO: Creating source tarball...
2021-10-16 06:57:46,048 INFO: Running 'build' commands in build/is.xyz.mpv/app
2021-10-16 06:57:46,049 DEBUG: Directory: build/is.xyz.mpv/app
2021-10-16 06:57:46,049 DEBUG: > bash -x -c cd ../buildscripts/ && ./buildall.sh --arch arm64 mpv && ./buildall.sh
+ cd ../buildscripts/
+ ./buildall.sh --arch arm64 mpv
�[1;34mBuilding mpv...�[m
Dependencies: ffmpeg libass lua
�[1;34mBuilding ffmpeg...�[m
Dependencies: mbedtls dav1d
�[1;34mBuilding mbedtls...�[m
Dependencies: 
~/build/is.xyz.mpv/buildscripts/deps/mbedtls ~/build/is.xyz.mpv/buildscripts
  CC    aes.c
  CC    aesni.c
  CC    arc4.c
  CC    aria.c
  CC    asn1parse.c
clang-12: error: no input files
clang-12: error: no input files
clang-12: error: no input files
Makefile:274: recipe for target 'aesni.o' failed
make[1]: *** [aesni.o] Error 1
make[1]: *** Waiting for unfinished jobs....
clang-12: error: no input files
clang-12: error: no input files
Makefile:274: recipe for target 'aes.o' failed
make[1]: *** [aes.o] Error 1
Makefile:274: recipe for target 'arc4.o' failed
make[1]: *** [arc4.o] Error 1
Makefile:274: recipe for target 'aria.o' failed
make[1]: *** [aria.o] Error 1
Makefile:274: recipe for target 'asn1parse.o' failed
make[1]: *** [asn1parse.o] Error 1
Makefile:17: recipe for target 'lib' failed
make: *** [lib] Error 2
make: *** Waiting for unfinished jobs....
  CC    src/helpers.c
  CC    src/asn1_helpers.c
  CC    src/psa_crypto_helpers.c
  CC    src/psa_exercise_key.c
  CC    src/threading_helpers.c
  CC    src/random.c
clang-12: error: no input files
clang-12: error: no input files
clang-12clang-12: : errorerror: : no input filesno input files

Makefile:96: recipe for target 'src/psa_exercise_key.o' failed
make[1]: *** [src/psa_exercise_key.o] Error 1
make[1]: *** Waiting for unfinished jobs....
Makefile:96: recipe for target 'src/threading_helpers.o' failed
make[1]: *** [src/threading_helpers.o] Error 1
Makefile:96: recipe for target 'src/helpers.o' failed
make[1]: *** [src/helpers.o] Error 1
Makefile:96: recipe for target 'src/asn1_helpers.o' failed
make[1]: *** [src/asn1_helpers.o] Error 1
clang-12: error: no input files
clang-12: error: no input files
Makefile:96: recipe for target 'src/psa_crypto_helpers.o' failed
make[1]: *** [src/psa_crypto_helpers.o] Error 1
Makefile:96: recipe for target 'src/random.o' failed
make[1]: *** [src/random.o] Error 1
Makefile:23: recipe for target 'mbedtls_test' failed
make: *** [mbedtls_test] Error 2
2021-10-16 06:57:46,356 ERROR: Could not build app is.xyz.mpv: Error running build command for is.xyz.mpv:2021-10-10-release
==== detail begin ====
+ cd ../buildscripts/
+ ./buildall.sh --arch arm64 mpv
�[1;34mBuilding mpv...�[m
Dependencies: ffmpeg libass lua
�[1;34mBuilding ffmpeg...�[m
Dependencies: mbedtls dav1d
�[1;34mBuilding mbedtls...�[m
Dependencies: 
~/build/is.xyz.mpv/buildscripts/deps/mbedtls ~/build/is.xyz.mpv/buildscripts
  CC    aes.c
  CC    aesni.c
  CC    arc4.c
  CC    aria.c
  CC    asn1parse.c
clang-12: error: no input files
clang-12: error: no input files
clang-12: error: no input files
Makefile:274: recipe for target 'aesni.o' failed
make[1]: *** [aesni.o] Error 1
make[1]: *** Waiting for unfinished jobs....
clang-12: error: no input files
clang-12: error: no input files
Makefile:274: recipe for target 'aes.o' failed
make[1]: *** [aes.o] Error 1
Makefile:274: recipe for target 'arc4.o' failed
make[1]: *** [arc4.o] Error 1
Makefile:274: recipe for target 'aria.o' failed
make[1]: *** [aria.o] Error 1
Makefile:274: recipe for target 'asn1parse.o' failed
make[1]: *** [asn1parse.o] Error 1
Makefile:17: recipe for target 'lib' failed
make: *** [lib] Error 2
make: *** Waiting for unfinished jobs....
  CC    src/helpers.c
  CC    src/asn1_helpers.c
  CC    src/psa_crypto_helpers.c
  CC    src/psa_exercise_key.c
  CC    src/threading_helpers.c
  CC    src/random.c
clang-12: error: no input files
clang-12: error: no input files
clang-12clang-12: : errorerror: : no input filesno input files

Makefile:96: recipe for target 'src/psa_exercise_key.o' failed
make[1]: *** [src/psa_exercise_key.o] Error 1
make[1]: *** Waiting for unfinished jobs....
Makefile:96: recipe for target 'src/threading_helpers.o' failed
make[1]: *** [src/threading_helpers.o] Error 1
Makefile:96: recipe for target 'src/helpers.o' failed
make[1]: *** [src/helpers.o] Error 1
Makefile:96: recipe for target 'src/asn1_helpers.o' failed
make[1]: *** [src/asn1_helpers.o] Error 1
clang-12: error: no input files
clang-12: error: no input files
Makefile:96: recipe for target 'src/psa_crypto_helpers.o' failed
make[1]: *** [src/psa_crypto_helpers.o] Error 1
Makefile:96: recipe for target 'src/random.o' failed
make[1]: *** [src/random.o] Error 1
Makefile:23: recipe for target 'mbedtls_test' failed
make: *** [mbedtls_test] Error 2
==== detail end ====
2021-10-16 06:57:46,356 DEBUG: Error encoutered, stopping by user request.