Difference between revisions of "it.niedermann.owncloud.notes/lastbuild 3004014"

From F-Droid
Jump to: navigation, search
(Build log)
 
(Build log)
 
Line 1: Line 1:
* build session started at 2021-10-13 10:24:33Z
+
* build session started at 2021-10-15 20:33:40Z
* this build started at 2021-10-13 12:00:27Z
+
* this build started at 2021-10-16 05:46:42Z
* this build completed at 2021-10-13 12:05:43Z
+
* this build completed at 2021-10-16 05:53:13Z
* fdroiddata: [https://gitlab.com/fdroid/fdroiddata/commit/5ee529538202159f63512f2107f915449f75b25a 5ee529538202159f63512f2107f915449f75b25a]
+
* fdroiddata: [https://gitlab.com/fdroid/fdroiddata/commit/4a002fd17181af2e39e07216e043886f0a00f728 4a002fd17181af2e39e07216e043886f0a00f728]
 
* fdroidserverid: [https://gitlab.com/fdroid/fdroidserver/commit/bd079c9311737094e441e9a3e19f8841e9825b89 bd079c9311737094e441e9a3e19f8841e9825b89]
 
* fdroidserverid: [https://gitlab.com/fdroid/fdroidserver/commit/bd079c9311737094e441e9a3e19f8841e9825b89 bd079c9311737094e441e9a3e19f8841e9825b89]
  
Line 9: Line 9:
 
== Installed Android Tools ==
 
== Installed Android Tools ==
  
 +
* build-tools/19.1.0 (19.1)
 +
* build-tools/20.0.0 (20)
 +
* build-tools/21.1.2 (21.1.2)
 +
* build-tools/22.0.1 (22.0.1)
 +
* build-tools/23.0.1 (23.0.1)
 +
* build-tools/23.0.2 (23.0.2)
 +
* build-tools/23.0.3 (23.0.3)
 +
* build-tools/24.0.0 (24)
 +
* build-tools/24.0.1 (24.0.1)
 +
* build-tools/24.0.2 (24.0.2)
 +
* build-tools/24.0.3 (24.0.3)
 +
* build-tools/25.0.0 (25)
 +
* build-tools/25.0.1 (25.0.1)
 +
* build-tools/25.0.2 (25.0.2)
 +
* build-tools/25.0.3 (25.0.3)
 +
* build-tools/26.0.0 (26)
 +
* build-tools/26.0.1 (26.0.1)
 +
* build-tools/26.0.2 (26.0.2)
 +
* build-tools/26.0.3 (26.0.3)
 +
* build-tools/27.0.0 (27)
 +
* build-tools/27.0.1 (27.0.1)
 +
* build-tools/27.0.2 (27.0.2)
 +
* build-tools/27.0.3 (27.0.3)
 +
* build-tools/28.0.0 (28)
 +
* build-tools/28.0.1 (28.0.1)
 +
* build-tools/28.0.2 (28.0.2)
 +
* build-tools/28.0.3 (28.0.3)
 +
* build-tools/29.0.2 (29.0.2)
 +
* build-tools/29.0.3 (29.0.3)
 +
* extras/android/m2repository (47.0.0)
 +
* extras/m2repository/com/android/support/constraint/constraint-layout-solver/1.0.1 (1)
 +
* extras/m2repository/com/android/support/constraint/constraint-layout-solver/1.0.2 (1)
 +
* extras/m2repository/com/android/support/constraint/constraint-layout/1.0.1 (1)
 +
* extras/m2repository/com/android/support/constraint/constraint-layout/1.0.2 (1)
 +
* ndk/21.4.7075529 (21.4.7075529)
 +
* ndk/22.1.7171670 (22.1.7171670)
 +
* platform-tools (29.0.6)
 +
* platforms/android-10 (2)
 +
* platforms/android-11 (2)
 +
* platforms/android-12 (3)
 +
* platforms/android-13 (1)
 +
* platforms/android-14 (4)
 +
* platforms/android-15 (5)
 +
* platforms/android-16 (5)
 +
* platforms/android-17 (3)
 +
* platforms/android-18 (3)
 +
* platforms/android-19 (4)
 +
* platforms/android-20 (2)
 +
* platforms/android-21 (2)
 +
* platforms/android-22 (2)
 +
* platforms/android-23 (3)
 +
* platforms/android-24 (2)
 +
* platforms/android-25 (3)
 +
* platforms/android-26 (2)
 +
* platforms/android-27 (3)
 +
* platforms/android-28 (6)
 +
* platforms/android-29 (4)
 +
* platforms/android-7 (3)
 +
* platforms/android-8 (3)
 +
* platforms/android-9 (2)
 +
* r21e (None)
 +
* r22b (None)
 +
* tools (25.2.5)
  
  
 
== Build Log ==
 
== Build Log ==
  
'Build.py failed on server for it.niedermann.owncloud.notes:3.4.14'
+
Build succeeded
=detail=
+
<pre>
+
[...]
+
e for https://github.com/stefan-niedermann/nextcloud-notes.git
+
2021-10-13 12:03:45,508 DEBUG: > git --version
+
git version 2.11.0
+
2021-10-13 12:03:45,723 INFO: Using git version 2.11.0
+
2021-10-13 12:03:45,723 DEBUG: Checking 3.4.14
+
2021-10-13 12:03:45,724 INFO: Building version 3.4.14 (3004014) of it.niedermann.owncloud.notes
+
2021-10-13 12:03:45,724 INFO: Running 'sudo' commands in /home/vagrant
+
2021-10-13 12:03:45,725 DEBUG: > sudo DEBIAN_FRONTEND=noninteractive bash -x -c apt-get update || apt-get update && apt-get install -y openjdk-11-jdk-headless && update-alternatives --auto java
+
+ apt-get update
+
Hit:1 http://security.debian.org/debian-security stretch/updates InRelease
+
Ign:2 http://deb.debian.org/debian stretch InRelease
+
Hit:3 http://deb.debian.org/debian stretch-updates InRelease
+
Hit:4 http://deb.debian.org/debian stretch-backports-sloppy InRelease
+
Hit:5 http://deb.debian.org/debian stretch-backports InRelease
+
Hit:6 http://deb.debian.org/debian testing InRelease
+
Hit:7 http://deb.debian.org/debian stretch Release
+
Reading package lists...
+
+ apt-get install -y openjdk-11-jdk-headless
+
Reading package lists...
+
Building dependency tree...
+
Reading state information...
+
The following additional packages will be installed:
+
  libasound2 libasound2-data openjdk-11-jre-headless
+
Suggested packages:
+
  libasound2-plugins alsa-utils openjdk-11-demo openjdk-11-source libnss-mdns
+
  fonts-dejavu-extra fonts-ipafont-gothic fonts-ipafont-mincho
+
  fonts-wqy-microhei | fonts-wqy-zenhei fonts-indic
+
The following NEW packages will be installed:
+
  libasound2 libasound2-data openjdk-11-jdk-headless openjdk-11-jre-headless
+
0 upgraded, 4 newly installed, 0 to remove and 2 not upgraded.
+
Need to get 230 MB of archives.
+
After this operation, 374 MB of additional disk space will be used.
+
Get:1 http://deb.debian.org/debian stretch/main amd64 libasound2-data all 1.1.3-5 [173 kB]
+
Get:2 http://deb.debian.org/debian stretch/main amd64 libasound2 amd64 1.1.3-5 [497 kB]
+
Get:3 http://deb.debian.org/debian stretch-backports/main amd64 openjdk-11-jre-headless amd64 11.0.6+10-1~bpo9+1 [37.4 MB]
+
Get:4 http://deb.debian.org/debian stretch-backports/main amd64 openjdk-11-jdk-headless amd64 11.0.6+10-1~bpo9+1 [192 MB]
+
Fetched 230 MB in 2s (89.6 MB/s)
+
Selecting previously unselected package libasound2-data.
+
(Reading database ... 64914 files and directories currently installed.)
+
Preparing to unpack .../libasound2-data_1.1.3-5_all.deb ...
+
Unpacking libasound2-data (1.1.3-5) ...
+
Selecting previously unselected package libasound2:amd64.
+
Preparing to unpack .../libasound2_1.1.3-5_amd64.deb ...
+
Unpacking libasound2:amd64 (1.1.3-5) ...
+
Selecting previously unselected package openjdk-11-jre-headless:amd64.
+
Preparing to unpack .../openjdk-11-jre-headless_11.0.6+10-1~bpo9+1_amd64.deb ...
+
Unpacking openjdk-11-jre-headless:amd64 (11.0.6+10-1~bpo9+1) ...
+
Selecting previously unselected package openjdk-11-jdk-headless:amd64.
+
Preparing to unpack .../openjdk-11-jdk-headless_11.0.6+10-1~bpo9+1_amd64.deb ...
+
Unpacking openjdk-11-jdk-headless:amd64 (11.0.6+10-1~bpo9+1) ...
+
Setting up libasound2-data (1.1.3-5) ...
+
Setting up libasound2:amd64 (1.1.3-5) ...
+
Processing triggers for libc-bin (2.24-11+deb9u4) ...
+
Setting up openjdk-11-jre-headless:amd64 (11.0.6+10-1~bpo9+1) ...
+
Setting up openjdk-11-jdk-headless:amd64 (11.0.6+10-1~bpo9+1) ...
+
update-alternatives: using /usr/lib/jvm/java-11-openjdk-amd64/bin/jdeprscan to provide /usr/bin/jdeprscan (jdeprscan) in auto mode
+
update-alternatives: using /usr/lib/jvm/java-11-openjdk-amd64/bin/jimage to provide /usr/bin/jimage (jimage) in auto mode
+
update-alternatives: using /usr/lib/jvm/java-11-openjdk-amd64/bin/jlink to provide /usr/bin/jlink (jlink) in auto mode
+
update-alternatives: using /usr/lib/jvm/java-11-openjdk-amd64/bin/jmod to provide /usr/bin/jmod (jmod) in auto mode
+
update-alternatives: using /usr/lib/jvm/java-11-openjdk-amd64/bin/jshell to provide /usr/bin/jshell (jshell) in auto mode
+
update-alternatives: using /usr/lib/jvm/java-11-openjdk-amd64/bin/jaotc to provide /usr/bin/jaotc (jaotc) in auto mode
+
update-alternatives: using /usr/lib/jvm/java-11-openjdk-amd64/bin/jhsdb to provide /usr/bin/jhsdb (jhsdb) in auto mode
+
+ update-alternatives --auto java
+
update-alternatives: using /usr/lib/jvm/java-11-openjdk-amd64/bin/java to provide /usr/bin/java (java) in auto mode
+
2021-10-13 12:04:05,613 DEBUG: > sudo passwd --lock root
+
passwd: password expiry information changed.
+
2021-10-13 12:04:05,818 DEBUG: > sudo SUDO_FORCE_REMOVE=yes dpkg --purge sudo
+
(Reading database ... 65571 files and directories currently installed.)
+
Removing sudo (1.8.19p1-2.1+deb9u3) ...
+
Purging configuration files for sudo (1.8.19p1-2.1+deb9u3) ...
+
Processing triggers for systemd (232-25+deb9u13) ...
+
2021-10-13 12:04:11,017 INFO: Getting source for revision e3408a0c67d08e07bc63c7a9293ed1ce7cfd52ea
+
2021-10-13 12:04:11,018 DEBUG: Directory: build/it.niedermann.owncloud.notes
+
2021-10-13 12:04:11,018 DEBUG: > git rev-parse --show-toplevel
+
2021-10-13 12:04:11,225 DEBUG: Directory: build/it.niedermann.owncloud.notes
+
2021-10-13 12:04:11,226 DEBUG: > git submodule foreach --recursive git reset --hard
+
2021-10-13 12:04:11,532 DEBUG: Directory: build/it.niedermann.owncloud.notes
+
2021-10-13 12:04:11,532 DEBUG: > git reset --hard
+
2021-10-13 12:04:11,889 DEBUG: Directory: build/it.niedermann.owncloud.notes
+
2021-10-13 12:04:11,889 DEBUG: > git submodule foreach --recursive git clean -dffx
+
2021-10-13 12:04:11,994 DEBUG: Directory: build/it.niedermann.owncloud.notes
+
2021-10-13 12:04:11,994 DEBUG: > git clean -dffx
+
2021-10-13 12:04:12,099 DEBUG: Directory: build/it.niedermann.owncloud.notes
+
2021-10-13 12:04:12,100 DEBUG: > git -c core.askpass=/bin/true -c core.sshCommand=/bin/false -c url.https://.insteadOf=ssh:// -c url.https://u:p@bitbucket.org/.insteadOf=git@bitbucket.org: -c url.https://u:p@bitbucket.org.insteadOf=git://bitbucket.org -c url.https://u:p@bitbucket.org.insteadOf=https://bitbucket.org -c url.https://u:p@github.com/.insteadOf=git@github.com: -c url.https://u:p@github.com.insteadOf=git://github.com -c url.https://u:p@github.com.insteadOf=https://github.com -c url.https://u:p@gitlab.com/.insteadOf=git@gitlab.com: -c url.https://u:p@gitlab.com.insteadOf=git://gitlab.com -c url.https://u:p@gitlab.com.insteadOf=https://gitlab.com fetch origin
+
2021-10-13 12:04:13,233 DEBUG: Directory: build/it.niedermann.owncloud.notes
+
2021-10-13 12:04:13,233 DEBUG: > git -c core.askpass=/bin/true -c core.sshCommand=/bin/false -c url.https://.insteadOf=ssh:// -c url.https://u:p@bitbucket.org/.insteadOf=git@bitbucket.org: -c url.https://u:p@bitbucket.org.insteadOf=git://bitbucket.org -c url.https://u:p@bitbucket.org.insteadOf=https://bitbucket.org -c url.https://u:p@github.com/.insteadOf=git@github.com: -c url.https://u:p@github.com.insteadOf=git://github.com -c url.https://u:p@github.com.insteadOf=https://github.com -c url.https://u:p@gitlab.com/.insteadOf=git@gitlab.com: -c url.https://u:p@gitlab.com.insteadOf=git://gitlab.com -c url.https://u:p@gitlab.com.insteadOf=https://gitlab.com fetch --prune --tags --force origin
+
2021-10-13 12:04:13,541 DEBUG: Directory: build/it.niedermann.owncloud.notes
+
2021-10-13 12:04:13,542 DEBUG: > git remote set-head origin --auto
+
2021-10-13 12:04:13,965 DEBUG: Directory: build/it.niedermann.owncloud.notes
+
2021-10-13 12:04:13,966 DEBUG: > git checkout -f e3408a0c67d08e07bc63c7a9293ed1ce7cfd52ea
+
2021-10-13 12:04:14,181 DEBUG: Directory: build/it.niedermann.owncloud.notes
+
2021-10-13 12:04:14,182 DEBUG: > git clean -dffx
+
2021-10-13 12:04:14,340 INFO: Initialising submodules
+
2021-10-13 12:04:14,341 DEBUG: Directory: build/it.niedermann.owncloud.notes
+
2021-10-13 12:04:14,341 DEBUG: > git rev-parse --show-toplevel
+
2021-10-13 12:04:14,593 DEBUG: Directory: build/it.niedermann.owncloud.notes
+
2021-10-13 12:04:14,594 DEBUG: > git submodule sync
+
2021-10-13 12:04:14,699 DEBUG: Directory: build/it.niedermann.owncloud.notes
+
2021-10-13 12:04:14,700 DEBUG: > git -c core.askpass=/bin/true -c core.sshCommand=/bin/false -c url.https://.insteadOf=ssh:// -c url.https://u:p@bitbucket.org/.insteadOf=git@bitbucket.org: -c url.https://u:p@bitbucket.org.insteadOf=git://bitbucket.org -c url.https://u:p@bitbucket.org.insteadOf=https://bitbucket.org -c url.https://u:p@github.com/.insteadOf=git@github.com: -c url.https://u:p@github.com.insteadOf=git://github.com -c url.https://u:p@github.com.insteadOf=https://github.com -c url.https://u:p@gitlab.com/.insteadOf=git@gitlab.com: -c url.https://u:p@gitlab.com.insteadOf=git://gitlab.com -c url.https://u:p@gitlab.com.insteadOf=https://gitlab.com submodule update --init --force --recursive
+
2021-10-13 12:04:14,804 INFO: Creating local.properties file at build/it.niedermann.owncloud.notes/local.properties
+
2021-10-13 12:04:14,805 INFO: Creating local.properties file at build/it.niedermann.owncloud.notes/app/local.properties
+
2021-10-13 12:04:14,805 DEBUG: Removing debuggable flags from build/it.niedermann.owncloud.notes/app
+
2021-10-13 12:04:14,821 INFO: Cleaning Gradle project...
+
2021-10-13 12:04:14,821 DEBUG: Directory: build/it.niedermann.owncloud.notes/app
+
2021-10-13 12:04:14,821 DEBUG: > /home/vagrant/fdroidserver/gradlew-fdroid clean
+
Found 7.0.2 via distributionUrl
+
Running /opt/gradle/versions/7.0.2/bin/gradle clean
+
 
+
Welcome to Gradle 7.0.2!
+
 
+
Here are the highlights of this release:
+
- File system watching enabled by default
+
- Support for running with and building Java 16 projects
+
- Native support for Apple Silicon processors
+
- Dependency catalog feature preview
+
 
+
For more details see https://docs.gradle.org/7.0.2/release-notes.html
+
 
+
To honour the JVM settings for this build a single-use Daemon process will be forked. See https://docs.gradle.org/7.0.2/userguide/gradle_daemon.html#sec:disabling_the_daemon.
+
Daemon will be stopped at the end of the build
+
> Task :app:clean UP-TO-DATE
+
 
+
BUILD SUCCESSFUL in 21s
+
1 actionable task: 1 up-to-date
+
2021-10-13 12:04:36,501 INFO: Scanning source for common problems...
+
2021-10-13 12:04:36,507 INFO: Removing gradle-wrapper.jar at gradle/wrapper/gradle-wrapper.jar
+
2021-10-13 12:04:36,552 INFO: Creating source tarball...
+
2021-10-13 12:04:36,943 INFO: Building Gradle project...
+
2021-10-13 12:04:36,943 DEBUG: Directory: build/it.niedermann.owncloud.notes/app
+
2021-10-13 12:04:36,943 DEBUG: > /home/vagrant/fdroidserver/gradlew-fdroid assembleFdroidRelease
+
Found 7.0.2 via distributionUrl
+
Running /opt/gradle/versions/7.0.2/bin/gradle assembleFdroidRelease
+
To honour the JVM settings for this build a single-use Daemon process will be forked. See https://docs.gradle.org/7.0.2/userguide/gradle_daemon.html#sec:disabling_the_daemon.
+
Daemon will be stopped at the end of the build
+
Checking the license for package Android SDK Build-Tools 30.0.3 in /opt/android-sdk/licenses
+
License for package Android SDK Build-Tools 30.0.3 accepted.
+
Preparing "Install Android SDK Build-Tools 30.0.3 (revision: 30.0.3)".
+
"Install Android SDK Build-Tools 30.0.3 (revision: 30.0.3)" ready.
+
Installing Android SDK Build-Tools 30.0.3 in /opt/android-sdk/build-tools/30.0.3
+
"Install Android SDK Build-Tools 30.0.3 (revision: 30.0.3)" complete.
+
"Install Android SDK Build-Tools 30.0.3 (revision: 30.0.3)" finished.
+
Checking the license for package Android SDK Platform 30 in /opt/android-sdk/licenses
+
License for package Android SDK Platform 30 accepted.
+
Preparing "Install Android SDK Platform 30 (revision: 3)".
+
"Install Android SDK Platform 30 (revision: 3)" ready.
+
Installing Android SDK Platform 30 in /opt/android-sdk/platforms/android-30
+
"Install Android SDK Platform 30 (revision: 3)" complete.
+
"Install Android SDK Platform 30 (revision: 3)" finished.
+
> Task :app:preBuild UP-TO-DATE
+
> Task :app:preFdroidReleaseBuild UP-TO-DATE
+
> Task :markdown:preBuild UP-TO-DATE
+
> Task :markdown:preReleaseBuild UP-TO-DATE
+
> Task :markdown:compileReleaseAidl NO-SOURCE
+
> Task :app:compileFdroidReleaseAidl NO-SOURCE
+
> Task :markdown:packageReleaseRenderscript NO-SOURCE
+
> Task :app:compileFdroidReleaseRenderscript NO-SOURCE
+
> Task :app:dataBindingMergeDependencyArtifactsFdroidRelease FAILED
+
 
+
FAILURE: Build failed with an exception.
+
 
+
* What went wrong:
+
Execution failed for task ':app:dataBindingMergeDependencyArtifactsFdroidRelease'.
+
> Could not resolve all files for configuration ':app:fdroidReleaseCompileClasspath'.
+
  > Could not find com.github.nextcloud:Android-SingleSignOn:0.5.6.
+
    Required by:
+
        project :app
+
        project :app > com.github.stefan-niedermann.nextcloud-commons:sso-glide:1.4.0
+
        project :app > com.github.stefan-niedermann.nextcloud-commons:exception:1.4.0
+
 
+
* Try:
+
Run with --stacktrace option to get the stack trace. Run with --info or --debug option to get more log output. Run with --scan to get full insights.
+
 
+
* Get more help at https://help.gradle.org
+
 
+
BUILD FAILED in 21s
+
1 actionable task: 1 executed
+
2021-10-13 12:04:59,218 DEBUG: Popen(['git', 'cat-file', '--batch-check'], cwd=/home/vagrant/build/it.niedermann.owncloud.notes, universal_newlines=False, shell=None)
+
2021-10-13 12:04:59,225 ERROR: Could not build app it.niedermann.owncloud.notes: Build failed for it.niedermann.owncloud.notes:3.4.14@e3408a0c67d08e07bc63c7a9293ed1ce7cfd52ea
+
==== detail begin ====
+
Found 7.0.2 via distributionUrl
+
Running /opt/gradle/versions/7.0.2/bin/gradle assembleFdroidRelease
+
To honour the JVM settings for this build a single-use Daemon process will be forked. See https://docs.gradle.org/7.0.2/userguide/gradle_daemon.html#sec:disabling_the_daemon.
+
Daemon will be stopped at the end of the build
+
Checking the license for package Android SDK Build-Tools 30.0.3 in /opt/android-sdk/licenses
+
License for package Android SDK Build-Tools 30.0.3 accepted.
+
Preparing "Install Android SDK Build-Tools 30.0.3 (revision: 30.0.3)".
+
"Install Android SDK Build-Tools 30.0.3 (revision: 30.0.3)" ready.
+
Installing Android SDK Build-Tools 30.0.3 in /opt/android-sdk/build-tools/30.0.3
+
"Install Android SDK Build-Tools 30.0.3 (revision: 30.0.3)" complete.
+
"Install Android SDK Build-Tools 30.0.3 (revision: 30.0.3)" finished.
+
Checking the license for package Android SDK Platform 30 in /opt/android-sdk/licenses
+
License for package Android SDK Platform 30 accepted.
+
Preparing "Install Android SDK Platform 30 (revision: 3)".
+
"Install Android SDK Platform 30 (revision: 3)" ready.
+
Installing Android SDK Platform 30 in /opt/android-sdk/platforms/android-30
+
"Install Android SDK Platform 30 (revision: 3)" complete.
+
"Install Android SDK Platform 30 (revision: 3)" finished.
+
> Task :app:preBuild UP-TO-DATE
+
> Task :app:preFdroidReleaseBuild UP-TO-DATE
+
> Task :markdown:preBuild UP-TO-DATE
+
> Task :markdown:preReleaseBuild UP-TO-DATE
+
> Task :markdown:compileReleaseAidl NO-SOURCE
+
> Task :app:compileFdroidReleaseAidl NO-SOURCE
+
> Task :markdown:packageReleaseRenderscript NO-SOURCE
+
> Task :app:compileFdroidReleaseRenderscript NO-SOURCE
+
> Task :app:dataBindingMergeDependencyArtifactsFdroidRelease FAILED
+
 
+
FAILURE: Build failed with an exception.
+
 
+
* What went wrong:
+
Execution failed for task ':app:dataBindingMergeDependencyArtifactsFdroidRelease'.
+
> Could not resolve all files for configuration ':app:fdroidReleaseCompileClasspath'.
+
  > Could not find com.github.nextcloud:Android-SingleSignOn:0.5.6.
+
    Required by:
+
        project :app
+
        project :app > com.github.stefan-niedermann.nextcloud-commons:sso-glide:1.4.0
+
        project :app > com.github.stefan-niedermann.nextcloud-commons:exception:1.4.0
+
 
+
* Try:
+
Run with --stacktrace option to get the stack trace. Run with --info or --debug option to get more log output. Run with --scan to get full insights.
+
 
+
* Get more help at https://help.gradle.org
+
 
+
BUILD FAILED in 21s
+
1 actionable task: 1 executed
+
==== detail end ====
+
2021-10-13 12:04:59,231 DEBUG: Error encoutered, stopping by user request.
+
</pre>
+

Latest revision as of 05:53, 16 October 2021

Installed Android Tools

  • build-tools/19.1.0 (19.1)
  • build-tools/20.0.0 (20)
  • build-tools/21.1.2 (21.1.2)
  • build-tools/22.0.1 (22.0.1)
  • build-tools/23.0.1 (23.0.1)
  • build-tools/23.0.2 (23.0.2)
  • build-tools/23.0.3 (23.0.3)
  • build-tools/24.0.0 (24)
  • build-tools/24.0.1 (24.0.1)
  • build-tools/24.0.2 (24.0.2)
  • build-tools/24.0.3 (24.0.3)
  • build-tools/25.0.0 (25)
  • build-tools/25.0.1 (25.0.1)
  • build-tools/25.0.2 (25.0.2)
  • build-tools/25.0.3 (25.0.3)
  • build-tools/26.0.0 (26)
  • build-tools/26.0.1 (26.0.1)
  • build-tools/26.0.2 (26.0.2)
  • build-tools/26.0.3 (26.0.3)
  • build-tools/27.0.0 (27)
  • build-tools/27.0.1 (27.0.1)
  • build-tools/27.0.2 (27.0.2)
  • build-tools/27.0.3 (27.0.3)
  • build-tools/28.0.0 (28)
  • build-tools/28.0.1 (28.0.1)
  • build-tools/28.0.2 (28.0.2)
  • build-tools/28.0.3 (28.0.3)
  • build-tools/29.0.2 (29.0.2)
  • build-tools/29.0.3 (29.0.3)
  • extras/android/m2repository (47.0.0)
  • extras/m2repository/com/android/support/constraint/constraint-layout-solver/1.0.1 (1)
  • extras/m2repository/com/android/support/constraint/constraint-layout-solver/1.0.2 (1)
  • extras/m2repository/com/android/support/constraint/constraint-layout/1.0.1 (1)
  • extras/m2repository/com/android/support/constraint/constraint-layout/1.0.2 (1)
  • ndk/21.4.7075529 (21.4.7075529)
  • ndk/22.1.7171670 (22.1.7171670)
  • platform-tools (29.0.6)
  • platforms/android-10 (2)
  • platforms/android-11 (2)
  • platforms/android-12 (3)
  • platforms/android-13 (1)
  • platforms/android-14 (4)
  • platforms/android-15 (5)
  • platforms/android-16 (5)
  • platforms/android-17 (3)
  • platforms/android-18 (3)
  • platforms/android-19 (4)
  • platforms/android-20 (2)
  • platforms/android-21 (2)
  • platforms/android-22 (2)
  • platforms/android-23 (3)
  • platforms/android-24 (2)
  • platforms/android-25 (3)
  • platforms/android-26 (2)
  • platforms/android-27 (3)
  • platforms/android-28 (6)
  • platforms/android-29 (4)
  • platforms/android-7 (3)
  • platforms/android-8 (3)
  • platforms/android-9 (2)
  • r21e (None)
  • r22b (None)
  • tools (25.2.5)


Build Log

Build succeeded