Difference between revisions of "org.bombusmod/lastbuild 1422"

From F-Droid
Jump to: navigation, search
(Build log)
(Build log)
Line 1: Line 1:
* build session started at 2021-10-09 10:06:39Z
+
* build session started at 2021-10-11 17:49:25Z
* this build started at 2021-10-09 11:08:43Z
+
* this build started at 2021-10-11 19:01:00Z
* this build completed at 2021-10-09 11:14:35Z
+
* this build completed at 2021-10-11 19:05:59Z
* fdroiddata: [https://gitlab.com/fdroid/fdroiddata/commit/57bd1eaa7958fdebc5fa2727bac84aabfc21e970 57bd1eaa7958fdebc5fa2727bac84aabfc21e970]
+
* fdroiddata: [https://gitlab.com/fdroid/fdroiddata/commit/620fbcfdd58fbf07951d20557da1fda6a091a110 620fbcfdd58fbf07951d20557da1fda6a091a110]
 
* fdroidserverid: [https://gitlab.com/fdroid/fdroidserver/commit/bd079c9311737094e441e9a3e19f8841e9825b89 bd079c9311737094e441e9a3e19f8841e9825b89]
 
* fdroidserverid: [https://gitlab.com/fdroid/fdroidserver/commit/bd079c9311737094e441e9a3e19f8841e9825b89 bd079c9311737094e441e9a3e19f8841e9825b89]
  
Line 18: Line 18:
 
== Installed Android Tools ==
 
== Installed Android Tools ==
  
2021-10-09 11:13:07,291 DEBUG: Reading 'config.yml'
+
2021-10-11 19:04:15,581 DEBUG: Reading 'config.yml'
2021-10-09 11:13:07,302 INFO: Using /opt/android-sdk/build-tools/29.0.3/apksigner  
+
2021-10-11 19:04:15,591 INFO: Using /opt/android-sdk/build-tools/29.0.3/apksigner  
2021-10-09 11:13:07,305 INFO: Creating log directory
+
2021-10-11 19:04:15,595 INFO: Creating log directory
2021-10-09 11:13:07,305 INFO: Creating temporary directory
+
2021-10-11 19:04:15,595 INFO: Creating temporary directory
2021-10-09 11:13:07,306 INFO: Creating output directory
+
2021-10-11 19:04:15,595 INFO: Creating output directory
2021-10-09 11:13:07,308 DEBUG: Getting git vcs interface for https://github.com/BombusMod/BombusMod
+
2021-10-11 19:04:15,598 DEBUG: Getting git vcs interface for https://github.com/BombusMod/BombusMod
2021-10-09 11:13:07,309 DEBUG: > git --version
+
2021-10-11 19:04:15,598 DEBUG: > git --version
 
git version 2.11.0
 
git version 2.11.0
2021-10-09 11:13:07,526 INFO: Using git version 2.11.0
+
2021-10-11 19:04:15,809 INFO: Using git version 2.11.0
2021-10-09 11:13:07,526 DEBUG: Checking 0.9.1422
+
2021-10-11 19:04:15,809 DEBUG: Checking 0.9.1422
2021-10-09 11:13:07,527 INFO: Building version 0.9.1422 (1422) of org.bombusmod
+
2021-10-11 19:04:15,810 INFO: Building version 0.9.1422 (1422) of org.bombusmod
2021-10-09 11:13:07,528 INFO: Running 'sudo' commands in /home/vagrant
+
2021-10-11 19:04:15,810 INFO: Running 'sudo' commands in /home/vagrant
2021-10-09 11:13:07,529 DEBUG: > sudo DEBIAN_FRONTEND=noninteractive bash -x -c apt-get update || apt-get update && apt-get install -y openjdk-11-jdk-headless && update-alternatives --auto java
+
2021-10-11 19:04:15,811 DEBUG: > sudo DEBIAN_FRONTEND=noninteractive bash -x -c apt-get update || apt-get update && apt-get install -y openjdk-11-jdk-headless && update-alternatives --auto java
 
+ apt-get update
 
+ apt-get update
Hit:1 http://security.debian.org/debian-security stretch/updates InRelease
+
Ign:1 http://deb.debian.org/debian stretch InRelease
Ign:2 http://deb.debian.org/debian stretch InRelease
+
Get:2 http://security.debian.org/debian-security stretch/updates InRelease [53.0 kB]
 
Hit:3 http://deb.debian.org/debian stretch-updates InRelease
 
Hit:3 http://deb.debian.org/debian stretch-updates InRelease
 
Hit:4 http://deb.debian.org/debian stretch-backports-sloppy InRelease
 
Hit:4 http://deb.debian.org/debian stretch-backports-sloppy InRelease
Line 39: Line 39:
 
Hit:6 http://deb.debian.org/debian testing InRelease
 
Hit:6 http://deb.debian.org/debian testing InRelease
 
Hit:7 http://deb.debian.org/debian stretch Release
 
Hit:7 http://deb.debian.org/debian stretch Release
 +
Fetched 53.0 kB in 1s (52.2 kB/s)
 
Reading package lists...
 
Reading package lists...
 
+ apt-get install -y openjdk-11-jdk-headless
 
+ apt-get install -y openjdk-11-jdk-headless
Line 59: Line 60:
 
Get:3 http://deb.debian.org/debian stretch-backports/main amd64 openjdk-11-jre-headless amd64 11.0.6+10-1~bpo9+1 [37.4 MB]
 
Get:3 http://deb.debian.org/debian stretch-backports/main amd64 openjdk-11-jre-headless amd64 11.0.6+10-1~bpo9+1 [37.4 MB]
 
Get:4 http://deb.debian.org/debian stretch-backports/main amd64 openjdk-11-jdk-headless amd64 11.0.6+10-1~bpo9+1 [192 MB]
 
Get:4 http://deb.debian.org/debian stretch-backports/main amd64 openjdk-11-jdk-headless amd64 11.0.6+10-1~bpo9+1 [192 MB]
Fetched 230 MB in 3s (74.3 MB/s)
+
Fetched 230 MB in 2s (83.5 MB/s)
 
Selecting previously unselected package libasound2-data.
 
Selecting previously unselected package libasound2-data.
 
(Reading database ... 64914 files and directories currently installed.)
 
(Reading database ... 64914 files and directories currently installed.)
Line 87: Line 88:
 
+ update-alternatives --auto java
 
+ update-alternatives --auto java
 
update-alternatives: using /usr/lib/jvm/java-11-openjdk-amd64/bin/java to provide /usr/bin/java (java) in auto mode
 
update-alternatives: using /usr/lib/jvm/java-11-openjdk-amd64/bin/java to provide /usr/bin/java (java) in auto mode
2021-10-09 11:13:29,699 DEBUG: > sudo passwd --lock root
+
2021-10-11 19:04:35,799 DEBUG: > sudo passwd --lock root
 
passwd: password expiry information changed.
 
passwd: password expiry information changed.
2021-10-09 11:13:29,904 DEBUG: > sudo SUDO_FORCE_REMOVE=yes dpkg --purge sudo
+
2021-10-11 19:04:36,005 DEBUG: > sudo SUDO_FORCE_REMOVE=yes dpkg --purge sudo
 
(Reading database ... 65571 files and directories currently installed.)
 
(Reading database ... 65571 files and directories currently installed.)
 
Removing sudo (1.8.19p1-2.1+deb9u3) ...
 
Removing sudo (1.8.19p1-2.1+deb9u3) ...
 
Purging configuration files for sudo (1.8.19p1-2.1+deb9u3) ...
 
Purging configuration files for sudo (1.8.19p1-2.1+deb9u3) ...
 
Processing triggers for systemd (232-25+deb9u13) ...
 
Processing triggers for systemd (232-25+deb9u13) ...
2021-10-09 11:13:41,416 INFO: Getting source for revision a560e83863b43c82d4bf39f0d73d5051ee5c5663
+
2021-10-11 19:04:39,127 INFO: Getting source for revision a560e83863b43c82d4bf39f0d73d5051ee5c5663
2021-10-09 11:13:41,417 DEBUG: Directory: build/org.bombusmod
+
2021-10-11 19:04:39,128 DEBUG: Directory: build/org.bombusmod
2021-10-09 11:13:41,417 DEBUG: > git rev-parse --show-toplevel
+
2021-10-11 19:04:39,128 DEBUG: > git rev-parse --show-toplevel
2021-10-09 11:13:41,622 DEBUG: Directory: build/org.bombusmod
+
2021-10-11 19:04:39,633 DEBUG: Directory: build/org.bombusmod
2021-10-09 11:13:41,622 DEBUG: > git submodule foreach --recursive git reset --hard
+
2021-10-11 19:04:39,633 DEBUG: > git submodule foreach --recursive git reset --hard
2021-10-09 11:13:41,828 DEBUG: Directory: build/org.bombusmod
+
2021-10-11 19:04:40,340 DEBUG: Directory: build/org.bombusmod
2021-10-09 11:13:41,828 DEBUG: > git reset --hard
+
2021-10-11 19:04:40,340 DEBUG: > git reset --hard
2021-10-09 11:13:42,135 DEBUG: Directory: build/org.bombusmod
+
2021-10-11 19:04:40,545 DEBUG: Directory: build/org.bombusmod
2021-10-09 11:13:42,135 DEBUG: > git submodule foreach --recursive git clean -dffx
+
2021-10-11 19:04:40,546 DEBUG: > git submodule foreach --recursive git clean -dffx
2021-10-09 11:13:42,240 DEBUG: Directory: build/org.bombusmod
+
2021-10-11 19:04:40,651 DEBUG: Directory: build/org.bombusmod
2021-10-09 11:13:42,240 DEBUG: > git clean -dffx
+
2021-10-11 19:04:40,651 DEBUG: > git clean -dffx
2021-10-09 11:13:42,359 DEBUG: Directory: build/org.bombusmod
+
2021-10-11 19:04:40,755 DEBUG: Directory: build/org.bombusmod
2021-10-09 11:13:42,359 DEBUG: > git -c core.askpass=/bin/true -c core.sshCommand=/bin/false -c url.https://.insteadOf=ssh:// -c url.https://u:p@bitbucket.org/.insteadOf=git@bitbucket.org: -c url.https://u:p@bitbucket.org.insteadOf=git://bitbucket.org -c url.https://u:p@bitbucket.org.insteadOf=https://bitbucket.org -c url.https://u:p@github.com/.insteadOf=git@github.com: -c url.https://u:p@github.com.insteadOf=git://github.com -c url.https://u:p@github.com.insteadOf=https://github.com -c url.https://u:p@gitlab.com/.insteadOf=git@gitlab.com: -c url.https://u:p@gitlab.com.insteadOf=git://gitlab.com -c url.https://u:p@gitlab.com.insteadOf=https://gitlab.com fetch origin
+
2021-10-11 19:04:40,755 DEBUG: > git -c core.askpass=/bin/true -c core.sshCommand=/bin/false -c url.https://.insteadOf=ssh:// -c url.https://u:p@bitbucket.org/.insteadOf=git@bitbucket.org: -c url.https://u:p@bitbucket.org.insteadOf=git://bitbucket.org -c url.https://u:p@bitbucket.org.insteadOf=https://bitbucket.org -c url.https://u:p@github.com/.insteadOf=git@github.com: -c url.https://u:p@github.com.insteadOf=git://github.com -c url.https://u:p@github.com.insteadOf=https://github.com -c url.https://u:p@gitlab.com/.insteadOf=git@gitlab.com: -c url.https://u:p@gitlab.com.insteadOf=git://gitlab.com -c url.https://u:p@gitlab.com.insteadOf=https://gitlab.com fetch origin
2021-10-09 11:13:43,174 DEBUG: Directory: build/org.bombusmod
+
2021-10-11 19:04:42,264 DEBUG: Directory: build/org.bombusmod
2021-10-09 11:13:43,174 DEBUG: > git -c core.askpass=/bin/true -c core.sshCommand=/bin/false -c url.https://.insteadOf=ssh:// -c url.https://u:p@bitbucket.org/.insteadOf=git@bitbucket.org: -c url.https://u:p@bitbucket.org.insteadOf=git://bitbucket.org -c url.https://u:p@bitbucket.org.insteadOf=https://bitbucket.org -c url.https://u:p@github.com/.insteadOf=git@github.com: -c url.https://u:p@github.com.insteadOf=git://github.com -c url.https://u:p@github.com.insteadOf=https://github.com -c url.https://u:p@gitlab.com/.insteadOf=git@gitlab.com: -c url.https://u:p@gitlab.com.insteadOf=git://gitlab.com -c url.https://u:p@gitlab.com.insteadOf=https://gitlab.com fetch --prune --tags --force origin
+
2021-10-11 19:04:42,264 DEBUG: > git -c core.askpass=/bin/true -c core.sshCommand=/bin/false -c url.https://.insteadOf=ssh:// -c url.https://u:p@bitbucket.org/.insteadOf=git@bitbucket.org: -c url.https://u:p@bitbucket.org.insteadOf=git://bitbucket.org -c url.https://u:p@bitbucket.org.insteadOf=https://bitbucket.org -c url.https://u:p@github.com/.insteadOf=git@github.com: -c url.https://u:p@github.com.insteadOf=git://github.com -c url.https://u:p@github.com.insteadOf=https://github.com -c url.https://u:p@gitlab.com/.insteadOf=git@gitlab.com: -c url.https://u:p@gitlab.com.insteadOf=git://gitlab.com -c url.https://u:p@gitlab.com.insteadOf=https://gitlab.com fetch --prune --tags --force origin
2021-10-09 11:13:43,480 DEBUG: Directory: build/org.bombusmod
+
2021-10-11 19:04:42,569 DEBUG: Directory: build/org.bombusmod
2021-10-09 11:13:43,480 DEBUG: > git remote set-head origin --auto
+
2021-10-11 19:04:42,570 DEBUG: > git remote set-head origin --auto
2021-10-09 11:13:43,891 DEBUG: Directory: build/org.bombusmod
+
2021-10-11 19:04:42,977 DEBUG: Directory: build/org.bombusmod
2021-10-09 11:13:43,891 DEBUG: > git checkout -f a560e83863b43c82d4bf39f0d73d5051ee5c5663
+
2021-10-11 19:04:42,978 DEBUG: > git checkout -f a560e83863b43c82d4bf39f0d73d5051ee5c5663
2021-10-09 11:13:44,097 DEBUG: Directory: build/org.bombusmod
+
2021-10-11 19:04:43,183 DEBUG: Directory: build/org.bombusmod
2021-10-09 11:13:44,098 DEBUG: > git clean -dffx
+
2021-10-11 19:04:43,183 DEBUG: > git clean -dffx
2021-10-09 11:13:44,203 INFO: Creating local.properties file at build/org.bombusmod/local.properties
+
2021-10-11 19:04:43,288 INFO: Creating local.properties file at build/org.bombusmod/local.properties
2021-10-09 11:13:44,204 INFO: Creating local.properties file at build/org.bombusmod/android/local.properties
+
2021-10-11 19:04:43,289 INFO: Creating local.properties file at build/org.bombusmod/android/local.properties
2021-10-09 11:13:44,204 DEBUG: Removing debuggable flags from build/org.bombusmod/android
+
2021-10-11 19:04:43,290 DEBUG: Removing debuggable flags from build/org.bombusmod/android
2021-10-09 11:13:44,224 INFO: Cleaning Gradle project...
+
2021-10-11 19:04:43,295 INFO: Removing specified files
2021-10-09 11:13:44,224 DEBUG: Directory: build/org.bombusmod/android
+
2021-10-11 19:04:43,295 INFO: Removing docs
2021-10-09 11:13:44,224 DEBUG: > /home/vagrant/fdroidserver/gradlew-fdroid clean
+
2021-10-11 19:04:43,296 INFO: Removing desktop
 +
2021-10-11 19:04:43,298 INFO: Removing ios
 +
2021-10-11 19:04:43,311 INFO: Cleaning Gradle project...
 +
2021-10-11 19:04:43,312 DEBUG: Directory: build/org.bombusmod/android
 +
2021-10-11 19:04:43,312 DEBUG: > /home/vagrant/fdroidserver/gradlew-fdroid clean
 
Found 7.2 via distributionUrl
 
Found 7.2 via distributionUrl
 
Downloading missing gradle version 7.2
 
Downloading missing gradle version 7.2
Line 146: Line 151:
 
See https://docs.gradle.org/7.2/userguide/command_line_interface.html#sec:command_line_warnings
 
See https://docs.gradle.org/7.2/userguide/command_line_interface.html#sec:command_line_warnings
  
BUILD SUCCESSFUL in 25s
+
BUILD SUCCESSFUL in 38s
 
1 actionable task: 1 up-to-date
 
1 actionable task: 1 up-to-date
2021-10-09 11:14:21,041 INFO: Scanning source for common problems...
+
2021-10-11 19:05:27,272 INFO: Scanning source for common problems...
2021-10-09 11:14:21,050 INFO: Removing gradle-wrapper.jar at gradle/wrapper/gradle-wrapper.jar
+
2021-10-11 19:05:27,277 INFO: Removing gradle-wrapper.jar at gradle/wrapper/gradle-wrapper.jar
2021-10-09 11:14:21,051 ERROR: Found Java JAR file at docs/BombusMod.jar
+
2021-10-11 19:05:27,287 INFO: Ignoring binary at android/src/main/assets/smiles/animate.bin
2021-10-09 11:14:21,061 INFO: Ignoring binary at android/src/main/assets/smiles/animate.bin
+
2021-10-11 19:05:27,321 INFO: Creating source tarball...
2021-10-09 11:14:21,101 ERROR: Could not build app org.bombusmod: Can't build due to 1 error while scanning
+
2021-10-11 19:05:27,607 INFO: Building Gradle project...
2021-10-09 11:14:21,101 DEBUG: Error encoutered, stopping by user request.
+
2021-10-11 19:05:27,608 DEBUG: Directory: build/org.bombusmod/android
 +
2021-10-11 19:05:27,609 DEBUG: > /home/vagrant/fdroidserver/gradlew-fdroid assembleRelease
 +
Found 7.2 via distributionUrl
 +
Running /opt/gradle/versions/7.2/bin/gradle assembleRelease
 +
To honour the JVM settings for this build a single-use Daemon process will be forked. See https://docs.gradle.org/7.2/userguide/gradle_daemon.html#sec:disabling_the_daemon.
 +
Daemon will be stopped at the end of the build
 +
Checking the license for package Android SDK Build-Tools 30.0.2 in /opt/android-sdk/licenses
 +
License for package Android SDK Build-Tools 30.0.2 accepted.
 +
Preparing "Install Android SDK Build-Tools 30.0.2 (revision: 30.0.2)".
 +
 
 +
FAILURE: Build failed with an exception.
 +
 
 +
* What went wrong:
 +
'void org.apache.commons.compress.archivers.zip.ZipFile.<init>(java.nio.channels.SeekableByteChannel)'
 +
 
 +
* Try:
 +
Run with --stacktrace option to get the stack trace. Run with --info or --debug option to get more log output. Run with --scan to get full insights.
 +
 
 +
* Get more help at https://help.gradle.org
 +
 
 +
Deprecated Gradle features were used in this build, making it incompatible with Gradle 8.0.
 +
 
 +
You can use '--warning-mode all' to show the individual deprecation warnings and determine if they come from your own scripts or plugins.
 +
 
 +
See https://docs.gradle.org/7.2/userguide/command_line_interface.html#sec:command_line_warnings
 +
 
 +
BUILD FAILED in 10s
 +
2021-10-11 19:05:38,830 DEBUG: Popen(['git', 'cat-file', '--batch-check'], cwd=/home/vagrant/build/org.bombusmod, universal_newlines=False, shell=None)
 +
2021-10-11 19:05:38,835 ERROR: Could not build app org.bombusmod: Build failed for org.bombusmod:0.9.1422@a560e83863b43c82d4bf39f0d73d5051ee5c5663
 +
==== detail begin ====
 +
Found 7.2 via distributionUrl
 +
Running /opt/gradle/versions/7.2/bin/gradle assembleRelease
 +
To honour the JVM settings for this build a single-use Daemon process will be forked. See https://docs.gradle.org/7.2/userguide/gradle_daemon.html#sec:disabling_the_daemon.
 +
Daemon will be stopped at the end of the build
 +
Checking the license for package Android SDK Build-Tools 30.0.2 in /opt/android-sdk/licenses
 +
License for package Android SDK Build-Tools 30.0.2 accepted.
 +
Preparing "Install Android SDK Build-Tools 30.0.2 (revision: 30.0.2)".
 +
 
 +
FAILURE: Build failed with an exception.
 +
 
 +
* What went wrong:
 +
'void org.apache.commons.compress.archivers.zip.ZipFile.<init>(java.nio.channels.SeekableByteChannel)'
 +
 
 +
* Try:
 +
Run with --stacktrace option to get the stack trace. Run with --info or --debug option to get more log output. Run with --scan to get full insights.
 +
 
 +
* Get more help at https://help.gradle.org
 +
 
 +
Deprecated Gradle features were used in this build, making it incompatible with Gradle 8.0.
 +
 
 +
You can use '--warning-mode all' to show the individual deprecation warnings and determine if they come from your own scripts or plugins.
 +
 
 +
See https://docs.gradle.org/7.2/userguide/command_line_interface.html#sec:command_line_warnings
 +
 
 +
BUILD FAILED in 10s
 +
==== detail end ====
 +
2021-10-11 19:05:38,838 DEBUG: Error encoutered, stopping by user request.
 
</pre>
 
</pre>

Revision as of 19:06, 11 October 2021

Installed Android Tools

Build Log

'Build.py failed on server for org.bombusmod:0.9.1422'

detail

== Installed Android Tools ==

2021-10-11 19:04:15,581 DEBUG: Reading 'config.yml'
2021-10-11 19:04:15,591 INFO: Using /opt/android-sdk/build-tools/29.0.3/apksigner 
2021-10-11 19:04:15,595 INFO: Creating log directory
2021-10-11 19:04:15,595 INFO: Creating temporary directory
2021-10-11 19:04:15,595 INFO: Creating output directory
2021-10-11 19:04:15,598 DEBUG: Getting git vcs interface for https://github.com/BombusMod/BombusMod
2021-10-11 19:04:15,598 DEBUG: > git --version
git version 2.11.0
2021-10-11 19:04:15,809 INFO: Using git version 2.11.0
2021-10-11 19:04:15,809 DEBUG: Checking 0.9.1422
2021-10-11 19:04:15,810 INFO: Building version 0.9.1422 (1422) of org.bombusmod
2021-10-11 19:04:15,810 INFO: Running 'sudo' commands in /home/vagrant
2021-10-11 19:04:15,811 DEBUG: > sudo DEBIAN_FRONTEND=noninteractive bash -x -c apt-get update || apt-get update && apt-get install -y openjdk-11-jdk-headless && update-alternatives --auto java
+ apt-get update
Ign:1 http://deb.debian.org/debian stretch InRelease
Get:2 http://security.debian.org/debian-security stretch/updates InRelease [53.0 kB]
Hit:3 http://deb.debian.org/debian stretch-updates InRelease
Hit:4 http://deb.debian.org/debian stretch-backports-sloppy InRelease
Hit:5 http://deb.debian.org/debian stretch-backports InRelease
Hit:6 http://deb.debian.org/debian testing InRelease
Hit:7 http://deb.debian.org/debian stretch Release
Fetched 53.0 kB in 1s (52.2 kB/s)
Reading package lists...
+ apt-get install -y openjdk-11-jdk-headless
Reading package lists...
Building dependency tree...
Reading state information...
The following additional packages will be installed:
  libasound2 libasound2-data openjdk-11-jre-headless
Suggested packages:
  libasound2-plugins alsa-utils openjdk-11-demo openjdk-11-source libnss-mdns
  fonts-dejavu-extra fonts-ipafont-gothic fonts-ipafont-mincho
  fonts-wqy-microhei | fonts-wqy-zenhei fonts-indic
The following NEW packages will be installed:
  libasound2 libasound2-data openjdk-11-jdk-headless openjdk-11-jre-headless
0 upgraded, 4 newly installed, 0 to remove and 2 not upgraded.
Need to get 230 MB of archives.
After this operation, 374 MB of additional disk space will be used.
Get:1 http://deb.debian.org/debian stretch/main amd64 libasound2-data all 1.1.3-5 [173 kB]
Get:2 http://deb.debian.org/debian stretch/main amd64 libasound2 amd64 1.1.3-5 [497 kB]
Get:3 http://deb.debian.org/debian stretch-backports/main amd64 openjdk-11-jre-headless amd64 11.0.6+10-1~bpo9+1 [37.4 MB]
Get:4 http://deb.debian.org/debian stretch-backports/main amd64 openjdk-11-jdk-headless amd64 11.0.6+10-1~bpo9+1 [192 MB]
Fetched 230 MB in 2s (83.5 MB/s)
Selecting previously unselected package libasound2-data.
(Reading database ... 64914 files and directories currently installed.)
Preparing to unpack .../libasound2-data_1.1.3-5_all.deb ...
Unpacking libasound2-data (1.1.3-5) ...
Selecting previously unselected package libasound2:amd64.
Preparing to unpack .../libasound2_1.1.3-5_amd64.deb ...
Unpacking libasound2:amd64 (1.1.3-5) ...
Selecting previously unselected package openjdk-11-jre-headless:amd64.
Preparing to unpack .../openjdk-11-jre-headless_11.0.6+10-1~bpo9+1_amd64.deb ...
Unpacking openjdk-11-jre-headless:amd64 (11.0.6+10-1~bpo9+1) ...
Selecting previously unselected package openjdk-11-jdk-headless:amd64.
Preparing to unpack .../openjdk-11-jdk-headless_11.0.6+10-1~bpo9+1_amd64.deb ...
Unpacking openjdk-11-jdk-headless:amd64 (11.0.6+10-1~bpo9+1) ...
Setting up libasound2-data (1.1.3-5) ...
Setting up libasound2:amd64 (1.1.3-5) ...
Processing triggers for libc-bin (2.24-11+deb9u4) ...
Setting up openjdk-11-jre-headless:amd64 (11.0.6+10-1~bpo9+1) ...
Setting up openjdk-11-jdk-headless:amd64 (11.0.6+10-1~bpo9+1) ...
update-alternatives: using /usr/lib/jvm/java-11-openjdk-amd64/bin/jdeprscan to provide /usr/bin/jdeprscan (jdeprscan) in auto mode
update-alternatives: using /usr/lib/jvm/java-11-openjdk-amd64/bin/jimage to provide /usr/bin/jimage (jimage) in auto mode
update-alternatives: using /usr/lib/jvm/java-11-openjdk-amd64/bin/jlink to provide /usr/bin/jlink (jlink) in auto mode
update-alternatives: using /usr/lib/jvm/java-11-openjdk-amd64/bin/jmod to provide /usr/bin/jmod (jmod) in auto mode
update-alternatives: using /usr/lib/jvm/java-11-openjdk-amd64/bin/jshell to provide /usr/bin/jshell (jshell) in auto mode
update-alternatives: using /usr/lib/jvm/java-11-openjdk-amd64/bin/jaotc to provide /usr/bin/jaotc (jaotc) in auto mode
update-alternatives: using /usr/lib/jvm/java-11-openjdk-amd64/bin/jhsdb to provide /usr/bin/jhsdb (jhsdb) in auto mode
+ update-alternatives --auto java
update-alternatives: using /usr/lib/jvm/java-11-openjdk-amd64/bin/java to provide /usr/bin/java (java) in auto mode
2021-10-11 19:04:35,799 DEBUG: > sudo passwd --lock root
passwd: password expiry information changed.
2021-10-11 19:04:36,005 DEBUG: > sudo SUDO_FORCE_REMOVE=yes dpkg --purge sudo
(Reading database ... 65571 files and directories currently installed.)
Removing sudo (1.8.19p1-2.1+deb9u3) ...
Purging configuration files for sudo (1.8.19p1-2.1+deb9u3) ...
Processing triggers for systemd (232-25+deb9u13) ...
2021-10-11 19:04:39,127 INFO: Getting source for revision a560e83863b43c82d4bf39f0d73d5051ee5c5663
2021-10-11 19:04:39,128 DEBUG: Directory: build/org.bombusmod
2021-10-11 19:04:39,128 DEBUG: > git rev-parse --show-toplevel
2021-10-11 19:04:39,633 DEBUG: Directory: build/org.bombusmod
2021-10-11 19:04:39,633 DEBUG: > git submodule foreach --recursive git reset --hard
2021-10-11 19:04:40,340 DEBUG: Directory: build/org.bombusmod
2021-10-11 19:04:40,340 DEBUG: > git reset --hard
2021-10-11 19:04:40,545 DEBUG: Directory: build/org.bombusmod
2021-10-11 19:04:40,546 DEBUG: > git submodule foreach --recursive git clean -dffx
2021-10-11 19:04:40,651 DEBUG: Directory: build/org.bombusmod
2021-10-11 19:04:40,651 DEBUG: > git clean -dffx
2021-10-11 19:04:40,755 DEBUG: Directory: build/org.bombusmod
2021-10-11 19:04:40,755 DEBUG: > git -c core.askpass=/bin/true -c core.sshCommand=/bin/false -c url.https://.insteadOf=ssh:// -c url.https://u:p@bitbucket.org/.insteadOf=git@bitbucket.org: -c url.https://u:p@bitbucket.org.insteadOf=git://bitbucket.org -c url.https://u:p@bitbucket.org.insteadOf=https://bitbucket.org -c url.https://u:p@github.com/.insteadOf=git@github.com: -c url.https://u:p@github.com.insteadOf=git://github.com -c url.https://u:p@github.com.insteadOf=https://github.com -c url.https://u:p@gitlab.com/.insteadOf=git@gitlab.com: -c url.https://u:p@gitlab.com.insteadOf=git://gitlab.com -c url.https://u:p@gitlab.com.insteadOf=https://gitlab.com fetch origin
2021-10-11 19:04:42,264 DEBUG: Directory: build/org.bombusmod
2021-10-11 19:04:42,264 DEBUG: > git -c core.askpass=/bin/true -c core.sshCommand=/bin/false -c url.https://.insteadOf=ssh:// -c url.https://u:p@bitbucket.org/.insteadOf=git@bitbucket.org: -c url.https://u:p@bitbucket.org.insteadOf=git://bitbucket.org -c url.https://u:p@bitbucket.org.insteadOf=https://bitbucket.org -c url.https://u:p@github.com/.insteadOf=git@github.com: -c url.https://u:p@github.com.insteadOf=git://github.com -c url.https://u:p@github.com.insteadOf=https://github.com -c url.https://u:p@gitlab.com/.insteadOf=git@gitlab.com: -c url.https://u:p@gitlab.com.insteadOf=git://gitlab.com -c url.https://u:p@gitlab.com.insteadOf=https://gitlab.com fetch --prune --tags --force origin
2021-10-11 19:04:42,569 DEBUG: Directory: build/org.bombusmod
2021-10-11 19:04:42,570 DEBUG: > git remote set-head origin --auto
2021-10-11 19:04:42,977 DEBUG: Directory: build/org.bombusmod
2021-10-11 19:04:42,978 DEBUG: > git checkout -f a560e83863b43c82d4bf39f0d73d5051ee5c5663
2021-10-11 19:04:43,183 DEBUG: Directory: build/org.bombusmod
2021-10-11 19:04:43,183 DEBUG: > git clean -dffx
2021-10-11 19:04:43,288 INFO: Creating local.properties file at build/org.bombusmod/local.properties
2021-10-11 19:04:43,289 INFO: Creating local.properties file at build/org.bombusmod/android/local.properties
2021-10-11 19:04:43,290 DEBUG: Removing debuggable flags from build/org.bombusmod/android
2021-10-11 19:04:43,295 INFO: Removing specified files
2021-10-11 19:04:43,295 INFO: Removing docs
2021-10-11 19:04:43,296 INFO: Removing desktop
2021-10-11 19:04:43,298 INFO: Removing ios
2021-10-11 19:04:43,311 INFO: Cleaning Gradle project...
2021-10-11 19:04:43,312 DEBUG: Directory: build/org.bombusmod/android
2021-10-11 19:04:43,312 DEBUG: > /home/vagrant/fdroidserver/gradlew-fdroid clean
Found 7.2 via distributionUrl
Downloading missing gradle version 7.2
cachedir /home/vagrant/.cache/fdroidserver
/home/vagrant/.cache/fdroidserver/gradle-7.2-bin.zip: OK
Running /opt/gradle/versions/7.2/bin/gradle clean

Welcome to Gradle 7.2!

Here are the highlights of this release:
 - Toolchain support for Scala
 - More cache hits when Java source files have platform-specific line endings
 - More resilient remote HTTP build cache behavior

For more details see https://docs.gradle.org/7.2/release-notes.html

To honour the JVM settings for this build a single-use Daemon process will be forked. See https://docs.gradle.org/7.2/userguide/gradle_daemon.html#sec:disabling_the_daemon.
Daemon will be stopped at the end of the build 
> Task :android:clean UP-TO-DATE

Deprecated Gradle features were used in this build, making it incompatible with Gradle 8.0.

You can use '--warning-mode all' to show the individual deprecation warnings and determine if they come from your own scripts or plugins.

See https://docs.gradle.org/7.2/userguide/command_line_interface.html#sec:command_line_warnings

BUILD SUCCESSFUL in 38s
1 actionable task: 1 up-to-date
2021-10-11 19:05:27,272 INFO: Scanning source for common problems...
2021-10-11 19:05:27,277 INFO: Removing gradle-wrapper.jar at gradle/wrapper/gradle-wrapper.jar
2021-10-11 19:05:27,287 INFO: Ignoring binary at android/src/main/assets/smiles/animate.bin
2021-10-11 19:05:27,321 INFO: Creating source tarball...
2021-10-11 19:05:27,607 INFO: Building Gradle project...
2021-10-11 19:05:27,608 DEBUG: Directory: build/org.bombusmod/android
2021-10-11 19:05:27,609 DEBUG: > /home/vagrant/fdroidserver/gradlew-fdroid assembleRelease
Found 7.2 via distributionUrl
Running /opt/gradle/versions/7.2/bin/gradle assembleRelease
To honour the JVM settings for this build a single-use Daemon process will be forked. See https://docs.gradle.org/7.2/userguide/gradle_daemon.html#sec:disabling_the_daemon.
Daemon will be stopped at the end of the build 
Checking the license for package Android SDK Build-Tools 30.0.2 in /opt/android-sdk/licenses
License for package Android SDK Build-Tools 30.0.2 accepted.
Preparing "Install Android SDK Build-Tools 30.0.2 (revision: 30.0.2)".

FAILURE: Build failed with an exception.

* What went wrong:
'void org.apache.commons.compress.archivers.zip.ZipFile.<init>(java.nio.channels.SeekableByteChannel)'

* Try:
Run with --stacktrace option to get the stack trace. Run with --info or --debug option to get more log output. Run with --scan to get full insights.

* Get more help at https://help.gradle.org

Deprecated Gradle features were used in this build, making it incompatible with Gradle 8.0.

You can use '--warning-mode all' to show the individual deprecation warnings and determine if they come from your own scripts or plugins.

See https://docs.gradle.org/7.2/userguide/command_line_interface.html#sec:command_line_warnings

BUILD FAILED in 10s
2021-10-11 19:05:38,830 DEBUG: Popen(['git', 'cat-file', '--batch-check'], cwd=/home/vagrant/build/org.bombusmod, universal_newlines=False, shell=None)
2021-10-11 19:05:38,835 ERROR: Could not build app org.bombusmod: Build failed for org.bombusmod:0.9.1422@a560e83863b43c82d4bf39f0d73d5051ee5c5663
==== detail begin ====
Found 7.2 via distributionUrl
Running /opt/gradle/versions/7.2/bin/gradle assembleRelease
To honour the JVM settings for this build a single-use Daemon process will be forked. See https://docs.gradle.org/7.2/userguide/gradle_daemon.html#sec:disabling_the_daemon.
Daemon will be stopped at the end of the build 
Checking the license for package Android SDK Build-Tools 30.0.2 in /opt/android-sdk/licenses
License for package Android SDK Build-Tools 30.0.2 accepted.
Preparing "Install Android SDK Build-Tools 30.0.2 (revision: 30.0.2)".

FAILURE: Build failed with an exception.

* What went wrong:
'void org.apache.commons.compress.archivers.zip.ZipFile.<init>(java.nio.channels.SeekableByteChannel)'

* Try:
Run with --stacktrace option to get the stack trace. Run with --info or --debug option to get more log output. Run with --scan to get full insights.

* Get more help at https://help.gradle.org

Deprecated Gradle features were used in this build, making it incompatible with Gradle 8.0.

You can use '--warning-mode all' to show the individual deprecation warnings and determine if they come from your own scripts or plugins.

See https://docs.gradle.org/7.2/userguide/command_line_interface.html#sec:command_line_warnings

BUILD FAILED in 10s
==== detail end ====
2021-10-11 19:05:38,838 DEBUG: Error encoutered, stopping by user request.