Difference between revisions of "org.equeim.tremotesf/lastbuild 27"

From F-Droid
Jump to: navigation, search
(Build log)
(Build log)
Line 1: Line 1:
* build session started at 2019-08-28 04:46:22Z
+
* build session started at 2019-08-29 00:49:55Z
* this build started at 2019-08-28 12:03:22Z
+
* this build started at 2019-08-29 08:27:46Z
* this build completed at 2019-08-28 12:08:17Z
+
* this build completed at 2019-08-29 08:32:46Z
* fdroiddata: [https://gitlab.com/fdroid/fdroiddata/commit/ed8b8b84e542329262d2629b1936a50634df3e2e ed8b8b84e542329262d2629b1936a50634df3e2e]
+
* fdroiddata: [https://gitlab.com/fdroid/fdroiddata/commit/98bfa7ea06679f19b9a791aba75f11f9b312bb11 98bfa7ea06679f19b9a791aba75f11f9b312bb11]
 
* fdroidserverid: [https://gitlab.com/fdroid/fdroidserver/commit/39c589fb85e360aefc61eb26c44f6733103b7b1c 39c589fb85e360aefc61eb26c44f6733103b7b1c]
 
* fdroidserverid: [https://gitlab.com/fdroid/fdroidserver/commit/39c589fb85e360aefc61eb26c44f6733103b7b1c 39c589fb85e360aefc61eb26c44f6733103b7b1c]
  
Line 58: Line 58:
 
* Get more help at https://help.gradle.org
 
* Get more help at https://help.gradle.org
  
BUILD FAILED in 1m 12s
+
BUILD FAILED in 1m 11s
 
==== detail end ====
 
==== detail end ====
 
</pre>
 
</pre>

Revision as of 08:14, 29 August 2019

Installed Android Tools

Build Log

'Build.py failed on server for org.equeim.tremotesf:1.9.3'

detail

== Installed Android Tools ==

INFO: Creating log directory
INFO: Creating temporary directory
INFO: Creating output directory
INFO: Using git version 2.11.0
INFO: Building version 1.9.3 (27) of org.equeim.tremotesf
INFO: Running 'sudo' commands in /home/vagrant
INFO: Getting source for revision 1.9.3
INFO: Collecting source libraries
INFO: Creating local.properties file at build/org.equeim.tremotesf/local.properties
INFO: Creating local.properties file at build/org.equeim.tremotesf/app/local.properties
INFO: Running 'prebuild' commands in build/org.equeim.tremotesf/app
INFO: Cleaning Gradle project...
ERROR: Could not build app org.equeim.tremotesf: Error cleaning org.equeim.tremotesf:1.9.3
==== detail begin ====
Found 5.4.1 via distributionUrl
Running /opt/gradle/versions/5.4.1/bin/gradle clean

Welcome to Gradle 5.4.1!

Here are the highlights of this release:
 - Run builds with JDK12
 - New API for Incremental Tasks
 - Updates to native projects, including Swift 5 support

For more details see https://docs.gradle.org/5.4.1/release-notes.html

Starting a Gradle Daemon (subsequent builds will be faster)

FAILURE: Build failed with an exception.

* What went wrong:
A problem occurred configuring project ':app'.
> CMake '3.10.2' was not found in PATH or by cmake.dir property.
  - CMake '3.7.2' found in PATH did not match requested version '3.10.2'.

* Try:
Run with --stacktrace option to get the stack trace. Run with --info or --debug option to get more log output. Run with --scan to get full insights.

* Get more help at https://help.gradle.org

BUILD FAILED in 1m 11s
==== detail end ====