org.nonononoki.hendroid/lastbuild 158

From F-Droid
Revision as of 07:46, 30 November 2020 by Robot (Talk | contribs) (Build log)

(diff) ← Older revision | Latest revision (diff) | Newer revision → (diff)
Jump to: navigation, search

Installed Android Tools

Build Log

'Build.py failed on server for org.nonononoki.hendroid:1.13.1'

detail

== Installed Android Tools ==

2020-11-30 07:43:47,874 INFO: Creating log directory
2020-11-30 07:43:47,874 INFO: Creating temporary directory
2020-11-30 07:43:47,875 INFO: Creating output directory
2020-11-30 07:43:52,097 INFO: Using git version 2.11.0
2020-11-30 07:43:52,098 INFO: Building version 1.13.1 (158) of org.nonononoki.hendroid
2020-11-30 07:44:04,303 INFO: Getting source for revision 1.13.1
2020-11-30 07:44:06,516 INFO: Creating local.properties file at build/org.nonononoki.hendroid/local.properties
2020-11-30 07:44:06,517 INFO: Creating local.properties file at build/org.nonononoki.hendroid/app/local.properties
2020-11-30 07:44:06,535 INFO: Running 'prebuild' commands in build/org.nonononoki.hendroid/app
2020-11-30 07:44:06,744 INFO: Cleaning Gradle project...
2020-11-30 07:45:06,487 INFO: Scanning source for common problems...
2020-11-30 07:45:06,496 INFO: Removing gradle-wrapper.jar at gradle/wrapper/gradle-wrapper.jar
2020-11-30 07:45:06,556 INFO: Creating source tarball...
2020-11-30 07:45:07,000 INFO: Building Gradle project...
2020-11-30 07:46:18,375 ERROR: Could not build app org.nonononoki.hendroid: Build failed for org.nonononoki.hendroid:1.13.1
==== detail begin ====
Found 6.5 via distributionUrl
Running /opt/gradle/versions/6.5/bin/gradle assembleRelease
To honour the JVM settings for this build a new JVM will be forked. Please consider using the daemon: https://docs.gradle.org/6.5/userguide/gradle_daemon.html.
Daemon will be stopped at the end of the build stopping after processing

> Configure project :app
Warning: The 'kotlin-android-extensions' Gradle plugin is deprecated. Please use this migration guide (https://goo.gle/kotlin-android-extensions-deprecation) to start working with View Binding (https://developer.android.com/topic/libraries/view-binding) and the 'kotlin-parcelize' plugin.
File /home/vagrant/.android/repositories.cfg could not be loaded.
Checking the license for package Android SDK Platform 30 in /home/vagrant/android-sdk/licenses
License for package Android SDK Platform 30 accepted.
Preparing "Install Android SDK Platform 30 (revision: 3)".
"Install Android SDK Platform 30 (revision: 3)" ready.
Installing Android SDK Platform 30 in /home/vagrant/android-sdk/platforms/android-30
"Install Android SDK Platform 30 (revision: 3)" complete.
"Install Android SDK Platform 30 (revision: 3)" finished.

> Task :app:customssiv:preBuild UP-TO-DATE
> Task :app:customssiv:preReleaseBuild UP-TO-DATE
> Task :app:customssiv:compileReleaseAidl NO-SOURCE
> Task :app:customssiv:packageReleaseRenderscript NO-SOURCE
> Task :app:customssiv:compileReleaseRenderscript NO-SOURCE
> Task :app:objectboxPrepareBuild
> Task :app:preBuild
> Task :app:customssiv:generateReleaseResValues
> Task :app:customssiv:generateReleaseResources
> Task :app:customssiv:writeReleaseAarMetadata
> Task :app:extractProguardFiles
> Task :app:preReleaseBuild
> Task :app:compileReleaseAidl NO-SOURCE
> Task :app:compileReleaseRenderscript NO-SOURCE
> Task :app:generateReleaseBuildConfig
> Task :app:generateReleaseResValues FROM-CACHE
> Task :app:generateReleaseResources UP-TO-DATE
> Task :app:createReleaseCompatibleScreenManifests
> Task :app:extractDeepLinksRelease
> Task :app:customssiv:packageReleaseResources
> Task :app:javaPreCompileRelease
> Task :app:customssiv:extractDeepLinksRelease FROM-CACHE
> Task :app:customssiv:compileReleaseLibraryResources
> Task :app:customssiv:processReleaseManifest
> Task :app:customssiv:generateReleaseBuildConfig
> Task :app:customssiv:javaPreCompileRelease FROM-CACHE
> Task :app:customssiv:prepareLintJarForPublish
> Task :app:customssiv:parseReleaseLocalResources
> Task :app:checkReleaseAarMetadata
> Task :app:customssiv:mergeReleaseShaders
> Task :app:customssiv:compileReleaseShaders NO-SOURCE
> Task :app:customssiv:generateReleaseAssets UP-TO-DATE
> Task :app:customssiv:packageReleaseAssets
> Task :app:customssiv:generateReleaseRFile

> Task :app:processReleaseMainManifest
/home/vagrant/build/org.nonononoki.hendroid/app/src/main/AndroidManifest.xml:22:5-452:19 Warning:
	application@android:allowBackup was tagged at AndroidManifest.xml:22 to replace other declarations but no other declaration present
/home/vagrant/build/org.nonononoki.hendroid/app/src/main/AndroidManifest.xml:22:5-452:19 Warning:
	application@android:supportsRtl was tagged at AndroidManifest.xml:22 to replace other declarations but no other declaration present

> Task :app:processReleaseManifest
> Task :app:processReleaseManifestForPackage
> Task :app:mergeReleaseNativeDebugMetadata NO-SOURCE
> Task :app:mergeReleaseShaders FROM-CACHE
> Task :app:compileReleaseShaders NO-SOURCE
> Task :app:generateReleaseAssets UP-TO-DATE
> Task :app:mergeReleaseAssets
> Task :app:compressReleaseAssets
> Task :app:mergeReleaseResources
> Task :app:processReleaseResources
> Task :app:checkReleaseDuplicateClasses
> Task :app:processReleaseJavaRes NO-SOURCE
> Task :app:collectReleaseDependencies
> Task :app:sdkReleaseDependencyData
> Task :app:mergeReleaseJniLibFolders
> Task :app:customssiv:compileReleaseJavaWithJavac
> Task :app:customssiv:mergeReleaseGeneratedProguardFiles
> Task :app:customssiv:processReleaseJavaRes NO-SOURCE
> Task :app:customssiv:bundleLibResRelease NO-SOURCE
> Task :app:customssiv:exportReleaseConsumerProguardFiles
> Task :app:customssiv:bundleLibCompileToJarRelease
> Task :app:customssiv:mergeReleaseJniLibFolders FROM-CACHE
> Task :app:customssiv:mergeReleaseNativeLibs NO-SOURCE
> Task :app:customssiv:stripReleaseDebugSymbols NO-SOURCE
> Task :app:customssiv:bundleLibRuntimeToJarRelease
> Task :app:customssiv:copyReleaseJniLibsProjectOnly
> Task :app:customssiv:copyReleaseJniLibsProjectAndLocalJars FROM-CACHE
> Task :app:customssiv:extractReleaseAnnotations
> Task :app:customssiv:mergeReleaseConsumerProguardFiles
> Task :app:customssiv:compileReleaseSources
> Task :app:customssiv:mergeReleaseJavaResource
> Task :app:customssiv:mergeReleaseResources
> Task :app:customssiv:syncReleaseLibJars
> Task :app:customssiv:bundleReleaseAar
> Task :app:customssiv:verifyReleaseResources
> Task :app:customssiv:assembleRelease
> Task :app:kaptGenerateStubsReleaseKotlin

> Task :app:kaptReleaseKotlin
ID model file unchanged: default.json
ObjectBox Generator
Copyright 2017-2018 ObjectBox Ltd, objectbox.io. Licensed under GPL V3.
This program comes with ABSOLUTELY NO WARRANTY

> Task :app:mergeReleaseNativeLibs

> Task :app:stripReleaseDebugSymbols
WARNING: NDK was located by using ndk.dir property. This method is deprecated and will be removed in a future release. Please use android.ndkVersion or android.ndkPath in build.gradle to specify the NDK to use. https://developer.android.com/r/studio-ui/ndk-dir
NDK was located by using ndk.dir property. This method is deprecated and will be removed in a future release. Please use android.ndkVersion or android.ndkPath in build.gradle to specify the NDK to use. https://developer.android.com/r/studio-ui/ndk-dir

> Task :app:kaptReleaseKotlin
Processing schema version 1...
Written me.devsaki.hentoid.database.domains.ContentCursor.java
Written me.devsaki.hentoid.database.domains.Content_.java
Written me.devsaki.hentoid.database.domains.GroupCursor.java
Written me.devsaki.hentoid.database.domains.Group_.java
Written me.devsaki.hentoid.database.domains.SiteBookmarkCursor.java
Written me.devsaki.hentoid.database.domains.SiteBookmark_.java
Written me.devsaki.hentoid.database.domains.AttributeCursor.java
Written me.devsaki.hentoid.database.domains.Attribute_.java
Written me.devsaki.hentoid.database.domains.SiteHistoryCursor.java
Written me.devsaki.hentoid.database.domains.SiteHistory_.java
Written me.devsaki.hentoid.database.domains.ErrorRecordCursor.java
Written me.devsaki.hentoid.database.domains.ErrorRecord_.java
Written me.devsaki.hentoid.database.domains.GroupItemCursor.java
Written me.devsaki.hentoid.database.domains.GroupItem_.java
Written me.devsaki.hentoid.database.domains.AttributeLocationCursor.java
Written me.devsaki.hentoid.database.domains.AttributeLocation_.java
Written me.devsaki.hentoid.database.domains.ImageFileCursor.java
Written me.devsaki.hentoid.database.domains.ImageFile_.java
Written me.devsaki.hentoid.database.domains.QueueRecordCursor.java
Written me.devsaki.hentoid.database.domains.QueueRecord_.java
Written me.devsaki.hentoid.database.domains.MyObjectBox.java
Processed 10 entities in 204ms
Note: [ObjectBox] Starting ObjectBox processor (debug: false, incremental: true)
> Task :app:compileReleaseKotlin
w: /home/vagrant/build/org.nonononoki.hendroid/app/src/main/java/me/devsaki/hentoid/activities/AboutActivity.kt: (45, 23): Parameter 'event' is never used

> Task :app:compileReleaseJavaWithJavac
/home/vagrant/build/org.nonononoki.hendroid/app/src/main/java/me/devsaki/hentoid/util/GroupHelper.java:9: error: package com.google.firebase.crashlytics does not exist
import com.google.firebase.crashlytics.FirebaseCrashlytics;
                                      ^
/home/vagrant/build/org.nonononoki.hendroid/app/src/main/java/me/devsaki/hentoid/util/GroupHelper.java:104: error: cannot find symbol
            FirebaseCrashlytics crashlytics = FirebaseCrashlytics.getInstance();
            ^
  symbol:   class FirebaseCrashlytics
  location: class GroupHelper
/home/vagrant/build/org.nonononoki.hendroid/app/src/main/java/me/devsaki/hentoid/util/GroupHelper.java:104: error: cannot find symbol
            FirebaseCrashlytics crashlytics = FirebaseCrashlytics.getInstance();
                                              ^
  symbol:   variable FirebaseCrashlytics
  location: class GroupHelper
Note: Some input files use or override a deprecated API.
Note: Recompile with -Xlint:deprecation for details.
Note: Some input files use unchecked or unsafe operations.
Note: Recompile with -Xlint:unchecked for details.
3 errors

> Task :app:compileReleaseJavaWithJavac FAILED

FAILURE: Build failed with an exception.

* What went wrong:
Execution failed for task ':app:compileReleaseJavaWithJavac'.
> Compilation failed; see the compiler error output for details.

* Try:
Run with --stacktrace option to get the stack trace. Run with --info or --debug option to get more log output. Run with --scan to get full insights.

* Get more help at https://help.gradle.org

Deprecated Gradle features were used in this build, making it incompatible with Gradle 7.0.
Use '--warning-mode all' to show the individual deprecation warnings.
See https://docs.gradle.org/6.5/userguide/command_line_interface.html#sec:command_line_warnings

BUILD FAILED in 1m 10s
54 actionable tasks: 48 executed, 6 from cache
==== detail end ====