Difference between revisions of "org.ostrya.presencepublisher/lastbuild 34"

From F-Droid
Jump to: navigation, search
(Build log)
 
(Build log)
Line 1: Line 1:
* build session started at 2020-10-25 15:24:55Z
+
* build session started at 2020-10-26 13:25:13Z
* this build started at 2020-10-25 16:10:02Z
+
* this build started at 2020-10-26 14:28:43Z
* this build completed at 2020-10-25 16:15:35Z
+
* this build completed at 2020-10-26 14:32:22Z
* fdroiddata: [https://gitlab.com/fdroid/fdroiddata/commit/0c3c7427ffdf4f55a63c8e62f8d6903376949ddb 0c3c7427ffdf4f55a63c8e62f8d6903376949ddb]
+
* fdroiddata: [https://gitlab.com/fdroid/fdroiddata/commit/c1325906ed2f00f8bdd75e6a36acf3ce7eee2426 c1325906ed2f00f8bdd75e6a36acf3ce7eee2426]
 
* fdroidserverid: [https://gitlab.com/fdroid/fdroidserver/commit/1f7228d53859f078698468b2e0bbe48485e4ece7 1f7228d53859f078698468b2e0bbe48485e4ece7]
 
* fdroidserverid: [https://gitlab.com/fdroid/fdroidserver/commit/1f7228d53859f078698468b2e0bbe48485e4ece7 1f7228d53859f078698468b2e0bbe48485e4ece7]
  
Line 18: Line 18:
 
== Installed Android Tools ==
 
== Installed Android Tools ==
  
2020-10-25 16:12:36,634 INFO: Creating log directory
+
2020-10-26 14:29:49,106 INFO: Creating log directory
2020-10-25 16:12:36,635 INFO: Creating temporary directory
+
2020-10-26 14:29:49,106 INFO: Creating temporary directory
2020-10-25 16:12:36,635 INFO: Creating output directory
+
2020-10-26 14:29:49,106 INFO: Creating output directory
2020-10-25 16:12:39,984 INFO: Using git version 2.11.0
+
2020-10-26 14:29:51,688 INFO: Using git version 2.11.0
2020-10-25 16:12:39,984 INFO: Building version 2.2.4 (34) of org.ostrya.presencepublisher
+
2020-10-26 14:29:51,689 INFO: Building version 2.2.4 (34) of org.ostrya.presencepublisher
2020-10-25 16:13:03,225 INFO: Getting source for revision v2.2.4
+
2020-10-26 14:29:57,349 INFO: Getting source for revision v2.2.4
2020-10-25 16:13:06,031 INFO: Creating local.properties file at build/org.ostrya.presencepublisher/local.properties
+
2020-10-26 14:29:59,768 INFO: Creating local.properties file at build/org.ostrya.presencepublisher/local.properties
2020-10-25 16:13:06,032 INFO: Creating local.properties file at build/org.ostrya.presencepublisher/app/local.properties
+
2020-10-26 14:29:59,769 INFO: Creating local.properties file at build/org.ostrya.presencepublisher/app/local.properties
2020-10-25 16:13:06,040 INFO: Cleaned build.gradle.kts of keysigning configs at build/org.ostrya.presencepublisher/app/build.gradle.kts
+
2020-10-26 14:29:59,775 INFO: Cleaned build.gradle.kts of keysigning configs at build/org.ostrya.presencepublisher/app/build.gradle.kts
2020-10-25 16:13:06,046 INFO: Running 'prebuild' commands in build/org.ostrya.presencepublisher/app
+
2020-10-26 14:29:59,783 INFO: Running 'prebuild' commands in build/org.ostrya.presencepublisher/app
2020-10-25 16:13:06,250 INFO: Cleaning Gradle project...
+
2020-10-26 14:29:59,990 INFO: Cleaning Gradle project...
2020-10-25 16:14:38,089 INFO: Scanning source for common problems...
+
2020-10-26 14:31:48,660 INFO: Scanning source for common problems...
2020-10-25 16:14:38,094 INFO: Removing gradle-wrapper.jar at gradle/wrapper/gradle-wrapper.jar
+
2020-10-26 14:31:48,665 INFO: Removing gradle-wrapper.jar at gradle/wrapper/gradle-wrapper.jar
2020-10-25 16:14:38,106 INFO: Creating source tarball...
+
2020-10-26 14:31:48,678 INFO: Creating source tarball...
2020-10-25 16:14:38,222 INFO: Building Gradle project...
+
2020-10-26 14:31:48,794 INFO: Building Gradle project...
2020-10-25 16:15:18,126 ERROR: Could not build app org.ostrya.presencepublisher: Build failed for org.ostrya.presencepublisher:2.2.4
+
2020-10-26 14:32:09,284 ERROR: Could not build app org.ostrya.presencepublisher: Build failed for org.ostrya.presencepublisher:2.2.4
 
==== detail begin ====
 
==== detail begin ====
 
Found 6.6.1 via distributionUrl
 
Found 6.6.1 via distributionUrl
Line 60: Line 60:
 
* Get more help at https://help.gradle.org
 
* Get more help at https://help.gradle.org
  
BUILD FAILED in 39s
+
BUILD FAILED in 19s
 
1 actionable task: 1 executed
 
1 actionable task: 1 executed
 
==== detail end ====
 
==== detail end ====
 
</pre>
 
</pre>

Revision as of 14:32, 26 October 2020

Installed Android Tools

Build Log

'Build.py failed on server for org.ostrya.presencepublisher:2.2.4'

detail

== Installed Android Tools ==

2020-10-26 14:29:49,106 INFO: Creating log directory
2020-10-26 14:29:49,106 INFO: Creating temporary directory
2020-10-26 14:29:49,106 INFO: Creating output directory
2020-10-26 14:29:51,688 INFO: Using git version 2.11.0
2020-10-26 14:29:51,689 INFO: Building version 2.2.4 (34) of org.ostrya.presencepublisher
2020-10-26 14:29:57,349 INFO: Getting source for revision v2.2.4
2020-10-26 14:29:59,768 INFO: Creating local.properties file at build/org.ostrya.presencepublisher/local.properties
2020-10-26 14:29:59,769 INFO: Creating local.properties file at build/org.ostrya.presencepublisher/app/local.properties
2020-10-26 14:29:59,775 INFO: Cleaned build.gradle.kts of keysigning configs at build/org.ostrya.presencepublisher/app/build.gradle.kts
2020-10-26 14:29:59,783 INFO: Running 'prebuild' commands in build/org.ostrya.presencepublisher/app
2020-10-26 14:29:59,990 INFO: Cleaning Gradle project...
2020-10-26 14:31:48,660 INFO: Scanning source for common problems...
2020-10-26 14:31:48,665 INFO: Removing gradle-wrapper.jar at gradle/wrapper/gradle-wrapper.jar
2020-10-26 14:31:48,678 INFO: Creating source tarball...
2020-10-26 14:31:48,794 INFO: Building Gradle project...
2020-10-26 14:32:09,284 ERROR: Could not build app org.ostrya.presencepublisher: Build failed for org.ostrya.presencepublisher:2.2.4
==== detail begin ====
Found 6.6.1 via distributionUrl
Running /opt/gradle/versions/6.6.1/bin/gradle assembleRelease
To honour the JVM settings for this build a new JVM will be forked. Please consider using the daemon: https://docs.gradle.org/6.6.1/userguide/gradle_daemon.html.
Daemon will be stopped at the end of the build stopping after processing
File /home/vagrant/.android/repositories.cfg could not be loaded.
Checking the license for package Android SDK Platform 30 in /home/vagrant/android-sdk/licenses
License for package Android SDK Platform 30 accepted.
Preparing "Install Android SDK Platform 30 (revision: 3)".
"Install Android SDK Platform 30 (revision: 3)" ready.
Installing Android SDK Platform 30 in /home/vagrant/android-sdk/platforms/android-30
"Install Android SDK Platform 30 (revision: 3)" complete.
"Install Android SDK Platform 30 (revision: 3)" finished.
> Task :app:checkParameters FAILED

FAILURE: Build failed with an exception.

* What went wrong:
Execution failed for task ':app:checkParameters'.
> Version code should be 35

* Try:
Run with --stacktrace option to get the stack trace. Run with --info or --debug option to get more log output. Run with --scan to get full insights.

* Get more help at https://help.gradle.org

BUILD FAILED in 19s
1 actionable task: 1 executed
==== detail end ====