org.ostrya.presencepublisher/lastbuild 34

From F-Droid
Revision as of 14:32, 26 October 2020 by Robot (Talk | contribs) (Build log)

Jump to: navigation, search

Installed Android Tools

Build Log

'Build.py failed on server for org.ostrya.presencepublisher:2.2.4'

detail

== Installed Android Tools ==

2020-10-26 14:29:49,106 INFO: Creating log directory
2020-10-26 14:29:49,106 INFO: Creating temporary directory
2020-10-26 14:29:49,106 INFO: Creating output directory
2020-10-26 14:29:51,688 INFO: Using git version 2.11.0
2020-10-26 14:29:51,689 INFO: Building version 2.2.4 (34) of org.ostrya.presencepublisher
2020-10-26 14:29:57,349 INFO: Getting source for revision v2.2.4
2020-10-26 14:29:59,768 INFO: Creating local.properties file at build/org.ostrya.presencepublisher/local.properties
2020-10-26 14:29:59,769 INFO: Creating local.properties file at build/org.ostrya.presencepublisher/app/local.properties
2020-10-26 14:29:59,775 INFO: Cleaned build.gradle.kts of keysigning configs at build/org.ostrya.presencepublisher/app/build.gradle.kts
2020-10-26 14:29:59,783 INFO: Running 'prebuild' commands in build/org.ostrya.presencepublisher/app
2020-10-26 14:29:59,990 INFO: Cleaning Gradle project...
2020-10-26 14:31:48,660 INFO: Scanning source for common problems...
2020-10-26 14:31:48,665 INFO: Removing gradle-wrapper.jar at gradle/wrapper/gradle-wrapper.jar
2020-10-26 14:31:48,678 INFO: Creating source tarball...
2020-10-26 14:31:48,794 INFO: Building Gradle project...
2020-10-26 14:32:09,284 ERROR: Could not build app org.ostrya.presencepublisher: Build failed for org.ostrya.presencepublisher:2.2.4
==== detail begin ====
Found 6.6.1 via distributionUrl
Running /opt/gradle/versions/6.6.1/bin/gradle assembleRelease
To honour the JVM settings for this build a new JVM will be forked. Please consider using the daemon: https://docs.gradle.org/6.6.1/userguide/gradle_daemon.html.
Daemon will be stopped at the end of the build stopping after processing
File /home/vagrant/.android/repositories.cfg could not be loaded.
Checking the license for package Android SDK Platform 30 in /home/vagrant/android-sdk/licenses
License for package Android SDK Platform 30 accepted.
Preparing "Install Android SDK Platform 30 (revision: 3)".
"Install Android SDK Platform 30 (revision: 3)" ready.
Installing Android SDK Platform 30 in /home/vagrant/android-sdk/platforms/android-30
"Install Android SDK Platform 30 (revision: 3)" complete.
"Install Android SDK Platform 30 (revision: 3)" finished.
> Task :app:checkParameters FAILED

FAILURE: Build failed with an exception.

* What went wrong:
Execution failed for task ':app:checkParameters'.
> Version code should be 35

* Try:
Run with --stacktrace option to get the stack trace. Run with --info or --debug option to get more log output. Run with --scan to get full insights.

* Get more help at https://help.gradle.org

BUILD FAILED in 19s
1 actionable task: 1 executed
==== detail end ====