Difference between revisions of "xyz.hisname.fireflyiii/lastbuild 104"

From F-Droid
Jump to: navigation, search
(Build log)
 
(Build log)
 
Line 1: Line 1:
* build session started at 2021-10-25 20:14:16Z
+
* build session started at 2021-10-26 23:45:28Z
* this build started at 2021-10-25 20:17:06Z
+
* this build started at 2021-10-26 23:48:20Z
* this build completed at 2021-10-25 20:25:47Z
+
* this build completed at 2021-10-27 00:01:41Z
* fdroiddata: [https://gitlab.com/fdroid/fdroiddata/commit/93e1180f99935466721378b1ec2b819e2fe6ce88 93e1180f99935466721378b1ec2b819e2fe6ce88]
+
* fdroiddata: [https://gitlab.com/fdroid/fdroiddata/commit/bcc3c45cea4d3b6830ec37dd6d0e288d1c848508 bcc3c45cea4d3b6830ec37dd6d0e288d1c848508]
 
* fdroidserverid: [https://gitlab.com/fdroid/fdroidserver/commit/bd079c9311737094e441e9a3e19f8841e9825b89 bd079c9311737094e441e9a3e19f8841e9825b89]
 
* fdroidserverid: [https://gitlab.com/fdroid/fdroidserver/commit/bd079c9311737094e441e9a3e19f8841e9825b89 bd079c9311737094e441e9a3e19f8841e9825b89]
  
Line 9: Line 9:
 
== Installed Android Tools ==
 
== Installed Android Tools ==
  
 +
* build-tools/19.1.0 (19.1)
 +
* build-tools/20.0.0 (20)
 +
* build-tools/21.1.2 (21.1.2)
 +
* build-tools/22.0.1 (22.0.1)
 +
* build-tools/23.0.1 (23.0.1)
 +
* build-tools/23.0.2 (23.0.2)
 +
* build-tools/23.0.3 (23.0.3)
 +
* build-tools/24.0.0 (24)
 +
* build-tools/24.0.1 (24.0.1)
 +
* build-tools/24.0.2 (24.0.2)
 +
* build-tools/24.0.3 (24.0.3)
 +
* build-tools/25.0.0 (25)
 +
* build-tools/25.0.1 (25.0.1)
 +
* build-tools/25.0.2 (25.0.2)
 +
* build-tools/25.0.3 (25.0.3)
 +
* build-tools/26.0.0 (26)
 +
* build-tools/26.0.1 (26.0.1)
 +
* build-tools/26.0.2 (26.0.2)
 +
* build-tools/26.0.3 (26.0.3)
 +
* build-tools/27.0.0 (27)
 +
* build-tools/27.0.1 (27.0.1)
 +
* build-tools/27.0.2 (27.0.2)
 +
* build-tools/27.0.3 (27.0.3)
 +
* build-tools/28.0.0 (28)
 +
* build-tools/28.0.1 (28.0.1)
 +
* build-tools/28.0.2 (28.0.2)
 +
* build-tools/28.0.3 (28.0.3)
 +
* build-tools/29.0.2 (29.0.2)
 +
* build-tools/29.0.3 (29.0.3)
 +
* extras/android/m2repository (47.0.0)
 +
* extras/m2repository/com/android/support/constraint/constraint-layout-solver/1.0.1 (1)
 +
* extras/m2repository/com/android/support/constraint/constraint-layout-solver/1.0.2 (1)
 +
* extras/m2repository/com/android/support/constraint/constraint-layout/1.0.1 (1)
 +
* extras/m2repository/com/android/support/constraint/constraint-layout/1.0.2 (1)
 +
* ndk/21.4.7075529 (21.4.7075529)
 +
* ndk/22.1.7171670 (22.1.7171670)
 +
* platform-tools (29.0.6)
 +
* platforms/android-10 (2)
 +
* platforms/android-11 (2)
 +
* platforms/android-12 (3)
 +
* platforms/android-13 (1)
 +
* platforms/android-14 (4)
 +
* platforms/android-15 (5)
 +
* platforms/android-16 (5)
 +
* platforms/android-17 (3)
 +
* platforms/android-18 (3)
 +
* platforms/android-19 (4)
 +
* platforms/android-20 (2)
 +
* platforms/android-21 (2)
 +
* platforms/android-22 (2)
 +
* platforms/android-23 (3)
 +
* platforms/android-24 (2)
 +
* platforms/android-25 (3)
 +
* platforms/android-26 (2)
 +
* platforms/android-27 (3)
 +
* platforms/android-28 (6)
 +
* platforms/android-29 (4)
 +
* platforms/android-7 (3)
 +
* platforms/android-8 (3)
 +
* platforms/android-9 (2)
 +
* r21e (None)
 +
* r22b (None)
 +
* tools (25.2.5)
  
  
 
== Build Log ==
 
== Build Log ==
  
'Build.py failed on server for xyz.hisname.fireflyiii:4.14.2'
+
Build succeeded
=detail=
+
<pre>
+
== Installed Android Tools ==
+
 
+
2021-10-25 20:23:31,353 DEBUG: Reading 'config.yml'
+
2021-10-25 20:23:31,365 INFO: Using /opt/android-sdk/build-tools/29.0.3/apksigner
+
2021-10-25 20:23:31,368 INFO: Creating log directory
+
2021-10-25 20:23:31,368 INFO: Creating temporary directory
+
2021-10-25 20:23:31,368 INFO: Creating output directory
+
2021-10-25 20:23:31,393 DEBUG: Getting git vcs interface for https://github.com/emansih/FireflyMobile
+
2021-10-25 20:23:31,393 DEBUG: > git --version
+
git version 2.11.0
+
2021-10-25 20:23:31,662 INFO: Using git version 2.11.0
+
2021-10-25 20:23:31,662 DEBUG: Checking 4.14.2
+
2021-10-25 20:23:31,662 INFO: Building version 4.14.2 (104) of xyz.hisname.fireflyiii
+
2021-10-25 20:23:31,663 DEBUG: > sudo passwd --lock root
+
passwd: password expiry information changed.
+
2021-10-25 20:23:31,887 DEBUG: > sudo SUDO_FORCE_REMOVE=yes dpkg --purge sudo
+
(Reading database ... 64914 files and directories currently installed.)
+
Removing sudo (1.8.19p1-2.1+deb9u3) ...
+
Purging configuration files for sudo (1.8.19p1-2.1+deb9u3) ...
+
Processing triggers for systemd (232-25+deb9u13) ...
+
2021-10-25 20:23:40,052 INFO: Getting source for revision 7eaf71d317223c6ddd72c905cbe9641852475eb6
+
2021-10-25 20:23:40,052 DEBUG: Directory: build/xyz.hisname.fireflyiii
+
2021-10-25 20:23:40,053 DEBUG: > git rev-parse --show-toplevel
+
2021-10-25 20:23:40,259 DEBUG: Directory: build/xyz.hisname.fireflyiii
+
2021-10-25 20:23:40,260 DEBUG: > git submodule foreach --recursive git reset --hard
+
2021-10-25 20:23:40,491 DEBUG: Directory: build/xyz.hisname.fireflyiii
+
2021-10-25 20:23:40,491 DEBUG: > git reset --hard
+
2021-10-25 20:23:40,809 DEBUG: Directory: build/xyz.hisname.fireflyiii
+
2021-10-25 20:23:40,809 DEBUG: > git submodule foreach --recursive git clean -dffx
+
2021-10-25 20:23:40,917 DEBUG: Directory: build/xyz.hisname.fireflyiii
+
2021-10-25 20:23:40,917 DEBUG: > git clean -dffx
+
2021-10-25 20:23:41,022 DEBUG: Directory: build/xyz.hisname.fireflyiii
+
2021-10-25 20:23:41,022 DEBUG: > git -c core.askpass=/bin/true -c core.sshCommand=/bin/false -c url.https://.insteadOf=ssh:// -c url.https://u:p@bitbucket.org/.insteadOf=git@bitbucket.org: -c url.https://u:p@bitbucket.org.insteadOf=git://bitbucket.org -c url.https://u:p@bitbucket.org.insteadOf=https://bitbucket.org -c url.https://u:p@github.com/.insteadOf=git@github.com: -c url.https://u:p@github.com.insteadOf=git://github.com -c url.https://u:p@github.com.insteadOf=https://github.com -c url.https://u:p@gitlab.com/.insteadOf=git@gitlab.com: -c url.https://u:p@gitlab.com.insteadOf=git://gitlab.com -c url.https://u:p@gitlab.com.insteadOf=https://gitlab.com fetch origin
+
2021-10-25 20:23:42,566 DEBUG: Directory: build/xyz.hisname.fireflyiii
+
2021-10-25 20:23:42,566 DEBUG: > git -c core.askpass=/bin/true -c core.sshCommand=/bin/false -c url.https://.insteadOf=ssh:// -c url.https://u:p@bitbucket.org/.insteadOf=git@bitbucket.org: -c url.https://u:p@bitbucket.org.insteadOf=git://bitbucket.org -c url.https://u:p@bitbucket.org.insteadOf=https://bitbucket.org -c url.https://u:p@github.com/.insteadOf=git@github.com: -c url.https://u:p@github.com.insteadOf=git://github.com -c url.https://u:p@github.com.insteadOf=https://github.com -c url.https://u:p@gitlab.com/.insteadOf=git@gitlab.com: -c url.https://u:p@gitlab.com.insteadOf=git://gitlab.com -c url.https://u:p@gitlab.com.insteadOf=https://gitlab.com fetch --prune --tags --force origin
+
2021-10-25 20:23:42,873 DEBUG: Directory: build/xyz.hisname.fireflyiii
+
2021-10-25 20:23:42,873 DEBUG: > git remote set-head origin --auto
+
2021-10-25 20:23:43,283 DEBUG: Directory: build/xyz.hisname.fireflyiii
+
2021-10-25 20:23:43,283 DEBUG: > git checkout -f 7eaf71d317223c6ddd72c905cbe9641852475eb6
+
2021-10-25 20:23:43,604 DEBUG: Directory: build/xyz.hisname.fireflyiii
+
2021-10-25 20:23:43,604 DEBUG: > git clean -dffx
+
2021-10-25 20:23:43,906 INFO: Creating local.properties file at build/xyz.hisname.fireflyiii/local.properties
+
2021-10-25 20:23:43,907 INFO: Creating local.properties file at build/xyz.hisname.fireflyiii/app/local.properties
+
2021-10-25 20:23:43,907 DEBUG: Removing debuggable flags from build/xyz.hisname.fireflyiii/app
+
2021-10-25 20:23:43,930 INFO: Cleaning Gradle project...
+
2021-10-25 20:23:43,930 DEBUG: Directory: build/xyz.hisname.fireflyiii/app
+
2021-10-25 20:23:43,930 DEBUG: > /home/vagrant/fdroidserver/gradlew-fdroid clean
+
Found 7.2 via distributionUrl
+
Downloading missing gradle version 7.2
+
cachedir /home/vagrant/.cache/fdroidserver
+
/home/vagrant/.cache/fdroidserver/gradle-7.2-bin.zip: OK
+
Running /opt/gradle/versions/7.2/bin/gradle clean
+
 
+
Welcome to Gradle 7.2!
+
 
+
Here are the highlights of this release:
+
- Toolchain support for Scala
+
- More cache hits when Java source files have platform-specific line endings
+
- More resilient remote HTTP build cache behavior
+
 
+
For more details see https://docs.gradle.org/7.2/release-notes.html
+
 
+
To honour the JVM settings for this build a single-use Daemon process will be forked. See https://docs.gradle.org/7.2/userguide/gradle_daemon.html#sec:disabling_the_daemon.
+
Daemon will be stopped at the end of the build
+
> Task :buildSrc:compileKotlin
+
> Task :buildSrc:compileJava NO-SOURCE
+
> Task :buildSrc:compileGroovy NO-SOURCE
+
> Task :buildSrc:pluginDescriptors
+
> Task :buildSrc:processResources NO-SOURCE
+
> Task :buildSrc:classes UP-TO-DATE
+
> Task :buildSrc:inspectClassesForKotlinIC
+
 
+
> Task :buildSrc:jar
+
:jar: No valid plugin descriptors were found in META-INF/gradle-plugins
+
 
+
> Task :buildSrc:assemble
+
> Task :buildSrc:compileTestKotlin NO-SOURCE
+
> Task :buildSrc:pluginUnderTestMetadata
+
> Task :buildSrc:compileTestJava NO-SOURCE
+
> Task :buildSrc:compileTestGroovy NO-SOURCE
+
> Task :buildSrc:processTestResources NO-SOURCE
+
> Task :buildSrc:testClasses UP-TO-DATE
+
> Task :buildSrc:test NO-SOURCE
+
> Task :buildSrc:validatePlugins
+
> Task :buildSrc:check
+
> Task :buildSrc:build
+
 
+
FAILURE: Build failed with an exception.
+
 
+
* Where:
+
Build file '/home/vagrant/build/xyz.hisname.fireflyiii/app/build.gradle' line: 1
+
 
+
* What went wrong:
+
A problem occurred evaluating project ':app'.
+
> Failed to apply plugin 'com.android.internal.application'.
+
  > Android Gradle plugin requires Java 11 to run. You are currently using Java 1.8.
+
    You can try some of the following options:
+
      - changing the IDE settings.
+
      - changing the JAVA_HOME environment variable.
+
      - changing `org.gradle.java.home` in `gradle.properties`.
+
 
+
* Try:
+
Run with --stacktrace option to get the stack trace. Run with --info or --debug option to get more log output. Run with --scan to get full insights.
+
 
+
* Get more help at https://help.gradle.org
+
 
+
Deprecated Gradle features were used in this build, making it incompatible with Gradle 8.0.
+
 
+
You can use '--warning-mode all' to show the individual deprecation warnings and determine if they come from your own scripts or plugins.
+
 
+
See https://docs.gradle.org/7.2/userguide/command_line_interface.html#sec:command_line_warnings
+
 
+
BUILD FAILED in 1m 45s
+
6 actionable tasks: 6 executed
+
2021-10-25 20:25:35,937 ERROR: Could not build app xyz.hisname.fireflyiii: Error cleaning xyz.hisname.fireflyiii:4.14.2
+
==== detail begin ====
+
Found 7.2 via distributionUrl
+
Downloading missing gradle version 7.2
+
cachedir /home/vagrant/.cache/fdroidserver
+
/home/vagrant/.cache/fdroidserver/gradle-7.2-bin.zip: OK
+
Running /opt/gradle/versions/7.2/bin/gradle clean
+
 
+
Welcome to Gradle 7.2!
+
 
+
Here are the highlights of this release:
+
- Toolchain support for Scala
+
- More cache hits when Java source files have platform-specific line endings
+
- More resilient remote HTTP build cache behavior
+
 
+
For more details see https://docs.gradle.org/7.2/release-notes.html
+
 
+
To honour the JVM settings for this build a single-use Daemon process will be forked. See https://docs.gradle.org/7.2/userguide/gradle_daemon.html#sec:disabling_the_daemon.
+
Daemon will be stopped at the end of the build
+
> Task :buildSrc:compileKotlin
+
> Task :buildSrc:compileJava NO-SOURCE
+
> Task :buildSrc:compileGroovy NO-SOURCE
+
> Task :buildSrc:pluginDescriptors
+
> Task :buildSrc:processResources NO-SOURCE
+
> Task :buildSrc:classes UP-TO-DATE
+
> Task :buildSrc:inspectClassesForKotlinIC
+
 
+
> Task :buildSrc:jar
+
:jar: No valid plugin descriptors were found in META-INF/gradle-plugins
+
 
+
> Task :buildSrc:assemble
+
> Task :buildSrc:compileTestKotlin NO-SOURCE
+
> Task :buildSrc:pluginUnderTestMetadata
+
> Task :buildSrc:compileTestJava NO-SOURCE
+
> Task :buildSrc:compileTestGroovy NO-SOURCE
+
> Task :buildSrc:processTestResources NO-SOURCE
+
> Task :buildSrc:testClasses UP-TO-DATE
+
> Task :buildSrc:test NO-SOURCE
+
> Task :buildSrc:validatePlugins
+
> Task :buildSrc:check
+
> Task :buildSrc:build
+
 
+
FAILURE: Build failed with an exception.
+
 
+
* Where:
+
Build file '/home/vagrant/build/xyz.hisname.fireflyiii/app/build.gradle' line: 1
+
 
+
* What went wrong:
+
A problem occurred evaluating project ':app'.
+
> Failed to apply plugin 'com.android.internal.application'.
+
  > Android Gradle plugin requires Java 11 to run. You are currently using Java 1.8.
+
    You can try some of the following options:
+
      - changing the IDE settings.
+
      - changing the JAVA_HOME environment variable.
+
      - changing `org.gradle.java.home` in `gradle.properties`.
+
 
+
* Try:
+
Run with --stacktrace option to get the stack trace. Run with --info or --debug option to get more log output. Run with --scan to get full insights.
+
 
+
* Get more help at https://help.gradle.org
+
 
+
Deprecated Gradle features were used in this build, making it incompatible with Gradle 8.0.
+
 
+
You can use '--warning-mode all' to show the individual deprecation warnings and determine if they come from your own scripts or plugins.
+
 
+
See https://docs.gradle.org/7.2/userguide/command_line_interface.html#sec:command_line_warnings
+
 
+
BUILD FAILED in 1m 45s
+
6 actionable tasks: 6 executed
+
==== detail end ====
+
2021-10-25 20:25:35,937 DEBUG: Error encoutered, stopping by user request.
+
</pre>
+

Latest revision as of 00:02, 27 October 2021

Installed Android Tools

  • build-tools/19.1.0 (19.1)
  • build-tools/20.0.0 (20)
  • build-tools/21.1.2 (21.1.2)
  • build-tools/22.0.1 (22.0.1)
  • build-tools/23.0.1 (23.0.1)
  • build-tools/23.0.2 (23.0.2)
  • build-tools/23.0.3 (23.0.3)
  • build-tools/24.0.0 (24)
  • build-tools/24.0.1 (24.0.1)
  • build-tools/24.0.2 (24.0.2)
  • build-tools/24.0.3 (24.0.3)
  • build-tools/25.0.0 (25)
  • build-tools/25.0.1 (25.0.1)
  • build-tools/25.0.2 (25.0.2)
  • build-tools/25.0.3 (25.0.3)
  • build-tools/26.0.0 (26)
  • build-tools/26.0.1 (26.0.1)
  • build-tools/26.0.2 (26.0.2)
  • build-tools/26.0.3 (26.0.3)
  • build-tools/27.0.0 (27)
  • build-tools/27.0.1 (27.0.1)
  • build-tools/27.0.2 (27.0.2)
  • build-tools/27.0.3 (27.0.3)
  • build-tools/28.0.0 (28)
  • build-tools/28.0.1 (28.0.1)
  • build-tools/28.0.2 (28.0.2)
  • build-tools/28.0.3 (28.0.3)
  • build-tools/29.0.2 (29.0.2)
  • build-tools/29.0.3 (29.0.3)
  • extras/android/m2repository (47.0.0)
  • extras/m2repository/com/android/support/constraint/constraint-layout-solver/1.0.1 (1)
  • extras/m2repository/com/android/support/constraint/constraint-layout-solver/1.0.2 (1)
  • extras/m2repository/com/android/support/constraint/constraint-layout/1.0.1 (1)
  • extras/m2repository/com/android/support/constraint/constraint-layout/1.0.2 (1)
  • ndk/21.4.7075529 (21.4.7075529)
  • ndk/22.1.7171670 (22.1.7171670)
  • platform-tools (29.0.6)
  • platforms/android-10 (2)
  • platforms/android-11 (2)
  • platforms/android-12 (3)
  • platforms/android-13 (1)
  • platforms/android-14 (4)
  • platforms/android-15 (5)
  • platforms/android-16 (5)
  • platforms/android-17 (3)
  • platforms/android-18 (3)
  • platforms/android-19 (4)
  • platforms/android-20 (2)
  • platforms/android-21 (2)
  • platforms/android-22 (2)
  • platforms/android-23 (3)
  • platforms/android-24 (2)
  • platforms/android-25 (3)
  • platforms/android-26 (2)
  • platforms/android-27 (3)
  • platforms/android-28 (6)
  • platforms/android-29 (4)
  • platforms/android-7 (3)
  • platforms/android-8 (3)
  • platforms/android-9 (2)
  • r21e (None)
  • r22b (None)
  • tools (25.2.5)


Build Log

Build succeeded