app.organicmaps/lastbuild 21101515

From F-Droid
Jump to: navigation, search

Installed Android Tools

Build Log

'Build.py failed on server for app.organicmaps:2021.10.15-15-FDroid'

detail

[...]
er ABI info - done
C/C++: googleRelease|armeabi-v7a :-- Check for working CXX compiler: /opt/android-sdk/ndk/21.4.7075529/toolchains/llvm/prebuilt/linux-x86_64/bin/clang++ - skipped
C/C++: googleRelease|armeabi-v7a :-- Detecting CXX compile features
C/C++: googleRelease|armeabi-v7a :-- Detecting CXX compile features - done
C/C++: googleRelease|armeabi-v7a :Setting PLATFORM_ANDROID to true
C/C++: googleRelease|armeabi-v7a :Build type: RelWithDebInfo
C/C++: googleRelease|armeabi-v7a :-- Looking for pthread.h
C/C++: googleRelease|armeabi-v7a :-- Looking for pthread.h - found
C/C++: googleRelease|armeabi-v7a :-- Performing Test CMAKE_HAVE_LIBC_PTHREAD
C/C++: googleRelease|armeabi-v7a :-- Performing Test CMAKE_HAVE_LIBC_PTHREAD - Failed
C/C++: googleRelease|armeabi-v7a :-- Looking for pthread_create in pthreads
C/C++: googleRelease|armeabi-v7a :-- Looking for pthread_create in pthreads - not found
C/C++: googleRelease|armeabi-v7a :-- Looking for pthread_create in pthread
C/C++: googleRelease|armeabi-v7a :-- Looking for pthread_create in pthread - not found
C/C++: googleRelease|armeabi-v7a :-- Check if compiler accepts -pthread
C/C++: googleRelease|armeabi-v7a :-- Check if compiler accepts -pthread - yes
C/C++: googleRelease|armeabi-v7a :-- Found Threads: TRUE  
C/C++: googleRelease|armeabi-v7a :-- Found Boost: /home/vagrant/build/app.organicmaps/3party/boost (found suitable exact version "1.76.0")  
C/C++: googleRelease|armeabi-v7a :Doing nothing, because we know nothing about developer frameworks dir
C/C++: googleRelease|armeabi-v7a :SKIP_TESTS: Skipping subdirectory bsdiff/bsdiff_tests
C/C++: googleRelease|armeabi-v7a :-- Looking for dlfcn.h
C/C++: googleRelease|armeabi-v7a :-- Looking for dlfcn.h - found
C/C++: googleRelease|armeabi-v7a :-- Looking for fcntl.h
C/C++: googleRelease|armeabi-v7a :-- Looking for fcntl.h - found
C/C++: googleRelease|armeabi-v7a :-- Looking for inttypes.h
C/C++: googleRelease|armeabi-v7a :-- Looking for inttypes.h - found
C/C++: googleRelease|armeabi-v7a :-- Looking for memory.h
C/C++: googleRelease|armeabi-v7a :-- Looking for memory.h - found
C/C++: googleRelease|armeabi-v7a :-- Looking for stdint.h
C/C++: googleRelease|armeabi-v7a :-- Looking for stdint.h - found
C/C++: googleRelease|armeabi-v7a :-- Looking for stdlib.h
C/C++: googleRelease|armeabi-v7a :-- Looking for stdlib.h - found
C/C++: googleRelease|armeabi-v7a :-- Looking for strings.h
C/C++: googleRelease|armeabi-v7a :-- Looking for strings.h - found
C/C++: googleRelease|armeabi-v7a :-- Looking for string.h
C/C++: googleRelease|armeabi-v7a :-- Looking for string.h - found
C/C++: googleRelease|armeabi-v7a :-- Looking for sys/stat.h
C/C++: googleRelease|armeabi-v7a :-- Looking for sys/stat.h - found
C/C++: googleRelease|armeabi-v7a :-- Looking for sys/types.h
C/C++: googleRelease|armeabi-v7a :-- Looking for sys/types.h - found
C/C++: googleRelease|armeabi-v7a :-- Looking for unistd.h
C/C++: googleRelease|armeabi-v7a :-- Looking for unistd.h - found
C/C++: googleRelease|armeabi-v7a :-- Looking for getpagesize
C/C++: googleRelease|armeabi-v7a :-- Looking for getpagesize - found
C/C++: googleRelease|armeabi-v7a :-- Looking for mmap
C/C++: googleRelease|armeabi-v7a :-- Looking for mmap - found
C/C++: googleRelease|armeabi-v7a :-- Looking for getrandom
C/C++: googleRelease|armeabi-v7a :-- Looking for getrandom - not found
C/C++: googleRelease|armeabi-v7a :-- Looking for arc4random_buf
C/C++: googleRelease|armeabi-v7a :-- Looking for arc4random_buf - found
C/C++: googleRelease|armeabi-v7a :-- Looking for 4 include files stdlib.h, ..., float.h
C/C++: googleRelease|armeabi-v7a :-- Looking for 4 include files stdlib.h, ..., float.h - found
C/C++: googleRelease|armeabi-v7a :-- Check if the system is big endian
C/C++: googleRelease|armeabi-v7a :-- Searching 16 bit integer
C/C++: googleRelease|armeabi-v7a :-- Looking for stddef.h
C/C++: googleRelease|armeabi-v7a :-- Looking for stddef.h - found
C/C++: googleRelease|armeabi-v7a :-- Check size of unsigned short
C/C++: googleRelease|armeabi-v7a :-- Check size of unsigned short - done
C/C++: googleRelease|armeabi-v7a :-- Searching 16 bit integer - Using unsigned short
C/C++: googleRelease|armeabi-v7a :-- Check if the system is big endian - little endian
C/C++: googleRelease|armeabi-v7a :-- Looking for off_t
C/C++: googleRelease|armeabi-v7a :-- Looking for off_t - not found
C/C++: googleRelease|armeabi-v7a :-- Looking for size_t
C/C++: googleRelease|armeabi-v7a :-- Looking for size_t - not found
C/C++: googleRelease|armeabi-v7a :-- Performing Test HAVE_SYSCALL_GETRANDOM
C/C++: googleRelease|armeabi-v7a :-- Performing Test HAVE_SYSCALL_GETRANDOM - Success
C/C++: googleRelease|armeabi-v7a :-- Performing Test FLAG_NO_STRICT_ALIASING
C/C++: googleRelease|armeabi-v7a :-- Performing Test FLAG_NO_STRICT_ALIASING - Success
C/C++: googleRelease|armeabi-v7a :-- Performing Test FLAG_VISIBILITY
C/C++: googleRelease|armeabi-v7a :-- Performing Test FLAG_VISIBILITY - Success
C/C++: googleRelease|armeabi-v7a :-- ===========================================================================
C/C++: googleRelease|armeabi-v7a :-- 
C/C++: googleRelease|armeabi-v7a :-- Configuration
C/C++: googleRelease|armeabi-v7a :--   Prefix ..................... /usr/local
C/C++: googleRelease|armeabi-v7a :--   Build type ................. RelWithDebInfo
C/C++: googleRelease|armeabi-v7a :--   Shared libraries ........... OFF
C/C++: googleRelease|armeabi-v7a :--   Character type ............. char (UTF-8)
C/C++: googleRelease|armeabi-v7a :-- 
C/C++: googleRelease|armeabi-v7a :--   Build documentation ........ OFF
C/C++: googleRelease|armeabi-v7a :--   Build examples ............. ON
C/C++: googleRelease|armeabi-v7a :--   Build fuzzers .............. OFF
C/C++: googleRelease|armeabi-v7a :--   Build tests ................ ON
C/C++: googleRelease|armeabi-v7a :--   Build tools (xmlwf) ........ ON
C/C++: googleRelease|armeabi-v7a :--   Build pkg-config file ...... ON
C/C++: googleRelease|armeabi-v7a :--   Install files .............. ON
C/C++: googleRelease|armeabi-v7a :-- 
C/C++: googleRelease|armeabi-v7a :--   Features
C/C++: googleRelease|armeabi-v7a :--     // Advanced options, changes not advised
C/C++: googleRelease|armeabi-v7a :--     Attributes info .......... OFF
C/C++: googleRelease|armeabi-v7a :--     Context bytes ............ 1024
C/C++: googleRelease|armeabi-v7a :--     DTD support .............. ON
C/C++: googleRelease|armeabi-v7a :--     Large size ............... OFF
C/C++: googleRelease|armeabi-v7a :--     Minimum size ............. OFF
C/C++: googleRelease|armeabi-v7a :--     Namespace support ........ ON
C/C++: googleRelease|armeabi-v7a :-- 
C/C++: googleRelease|armeabi-v7a :--   Entropy sources
C/C++: googleRelease|armeabi-v7a :--     getrandom ................ 
C/C++: googleRelease|armeabi-v7a :--     syscall SYS_getrandom .... 1
C/C++: googleRelease|armeabi-v7a :--     libbsd ................... OFF
C/C++: googleRelease|armeabi-v7a :--     /dev/random .............. ON
C/C++: googleRelease|armeabi-v7a :-- 
C/C++: googleRelease|armeabi-v7a :-- ===========================================================================
C/C++: googleRelease|armeabi-v7a :-- Looking for C++ include fnmatch.h
C/C++: googleRelease|armeabi-v7a :-- Looking for C++ include fnmatch.h - found
C/C++: googleRelease|armeabi-v7a :-- Check size of uint32_t
C/C++: googleRelease|armeabi-v7a :-- Check size of uint32_t - done
C/C++: googleRelease|armeabi-v7a :-- Looking for strtoll
C/C++: googleRelease|armeabi-v7a :-- Looking for strtoll - found
C/C++: googleRelease|armeabi-v7a :SKIP_TESTS: Skipping subdirectory opening_hours_tests
C/C++: googleRelease|armeabi-v7a :SKIP_TESTS: Skipping subdirectory opening_hours_integration_tests
C/C++: googleRelease|armeabi-v7a :SKIP_TESTS: Skipping subdirectory opening_hours_supported_features_tests
C/C++: googleRelease|armeabi-v7a :-- Could NOT find PythonInterp: Found unsuitable version "3.5.3", but required is at least "3.8" (found /usr/bin/python3)
C/C++: googleRelease|armeabi-v7a :CMake Error at CMakeLists.txt:329 (message):
C/C++: googleRelease|armeabi-v7a :  Could not find python to use in qt/, shaders/ and 3party/.
C/C++: googleRelease|armeabi-v7a :-- Configuring incomplete, errors occurred!
C/C++: googleRelease|armeabi-v7a :See also "/home/vagrant/build/app.organicmaps/android/nativeOutputs/RelWithDebInfo/68e2x1y5/armeabi-v7a/CMakeFiles/CMakeOutput.log".
C/C++: googleRelease|armeabi-v7a :See also "/home/vagrant/build/app.organicmaps/android/nativeOutputs/RelWithDebInfo/68e2x1y5/armeabi-v7a/CMakeFiles/CMakeError.log".

> Task :configureCMakeRelWithDebInfo[arm64-v8a, armeabi-v7a] FAILED
> Task :processFdroidReleaseManifestForPackage

FAILURE: Build failed with an exception.

* What went wrong:
Execution failed for task ':configureCMakeRelWithDebInfo[arm64-v8a, armeabi-v7a]'.
> [CXX1405] error when building with cmake using /home/vagrant/build/app.organicmaps/CMakeLists.txt: Build command failed.
  Error while executing process /opt/android-sdk/cmake/3.18.1/bin/cmake with arguments {-H/home/vagrant/build/app.organicmaps -DCMAKE_SYSTEM_NAME=Android -DCMAKE_EXPORT_COMPILE_COMMANDS=ON -DCMAKE_SYSTEM_VERSION=21 -DANDROID_PLATFORM=android-21 -DANDROID_ABI=armeabi-v7a -DCMAKE_ANDROID_ARCH_ABI=armeabi-v7a -DANDROID_NDK=/opt/android-sdk/ndk/21.4.7075529 -DCMAKE_ANDROID_NDK=/opt/android-sdk/ndk/21.4.7075529 -DCMAKE_TOOLCHAIN_FILE=/opt/android-sdk/ndk/21.4.7075529/build/cmake/android.toolchain.cmake -DCMAKE_MAKE_PROGRAM=/opt/android-sdk/cmake/3.18.1/bin/ninja -DCMAKE_C_FLAGS=-fno-function-sections -fno-data-sections -Wno-extern-c-compat -DCMAKE_CXX_FLAGS=-fexceptions -frtti -DCMAKE_LIBRARY_OUTPUT_DIRECTORY=/home/vagrant/build/app.organicmaps/android/build/intermediates/cxx/RelWithDebInfo/68e2x1y5/obj/armeabi-v7a -DCMAKE_RUNTIME_OUTPUT_DIRECTORY=/home/vagrant/build/app.organicmaps/android/build/intermediates/cxx/RelWithDebInfo/68e2x1y5/obj/armeabi-v7a -DCMAKE_BUILD_TYPE=RelWithDebInfo -B/home/vagrant/build/app.organicmaps/android/nativeOutputs/RelWithDebInfo/68e2x1y5/armeabi-v7a -GNinja -DANDROID_TOOLCHAIN=clang -DANDROID_STL=c++_static -DOS=linux -DSKIP_TESTS=ON -DUSE_PCH=OFF}
  -- Detecting C compiler ABI info
  -- Detecting C compiler ABI info - done
  -- Check for working C compiler: /opt/android-sdk/ndk/21.4.7075529/toolchains/llvm/prebuilt/linux-x86_64/bin/clang - skipped
  -- Detecting C compile features
  -- Detecting C compile features - done
  -- Detecting CXX compiler ABI info
  -- Detecting CXX compiler ABI info - done
  -- Check for working CXX compiler: /opt/android-sdk/ndk/21.4.7075529/toolchains/llvm/prebuilt/linux-x86_64/bin/clang++ - skipped
  -- Detecting CXX compile features
  -- Detecting CXX compile features - done
  -- Looking for pthread.h
  -- Looking for pthread.h - found
  -- Performing Test CMAKE_HAVE_LIBC_PTHREAD
  -- Performing Test CMAKE_HAVE_LIBC_PTHREAD - Failed
  -- Looking for pthread_create in pthreads
  -- Looking for pthread_create in pthreads - not found
  -- Looking for pthread_create in pthread
  -- Looking for pthread_create in pthread - not found
  -- Check if compiler accepts -pthread
  -- Check if compiler accepts -pthread - yes
  -- Found Threads: TRUE  
  -- Found Boost: /home/vagrant/build/app.organicmaps/3party/boost (found suitable exact version "1.76.0")  
  -- Looking for dlfcn.h
  -- Looking for dlfcn.h - found
  -- Looking for fcntl.h
  -- Looking for fcntl.h - found
  -- Looking for inttypes.h
  -- Looking for inttypes.h - found
  -- Looking for memory.h
  -- Looking for memory.h - found
  -- Looking for stdint.h
  -- Looking for stdint.h - found
  -- Looking for stdlib.h
  -- Looking for stdlib.h - found
  -- Looking for strings.h
  -- Looking for strings.h - found
  -- Looking for string.h
  -- Looking for string.h - found
  -- Looking for sys/stat.h
  -- Looking for sys/stat.h - found
  -- Looking for sys/types.h
  -- Looking for sys/types.h - found
  -- Looking for unistd.h
  -- Looking for unistd.h - found
  -- Looking for getpagesize
  -- Looking for getpagesize - found
  -- Looking for mmap
  -- Looking for mmap - found
  -- Looking for getrandom
  -- Looking for getrandom - not found
  -- Looking for arc4random_buf
  -- Looking for arc4random_buf - found
  -- Looking for 4 include files stdlib.h, ..., float.h
  -- Looking for 4 include files stdlib.h, ..., float.h - found
  -- Check if the system is big endian
  -- Searching 16 bit integer
  -- Looking for stddef.h
  -- Looking for stddef.h - found
  -- Check size of unsigned short
  -- Check size of unsigned short - done
  -- Searching 16 bit integer - Using unsigned short
  -- Check if the system is big endian - little endian
  -- Looking for off_t
  -- Looking for off_t - not found
  -- Looking for size_t
  -- Looking for size_t - not found
  -- Performing Test HAVE_SYSCALL_GETRANDOM
  -- Performing Test HAVE_SYSCALL_GETRANDOM - Success
  -- Performing Test FLAG_NO_STRICT_ALIASING
  -- Performing Test FLAG_NO_STRICT_ALIASING - Success
  -- Performing Test FLAG_VISIBILITY
  -- Performing Test FLAG_VISIBILITY - Success
  -- ===========================================================================
  -- 
  -- Configuration
  --   Prefix ..................... /usr/local
  --   Build type ................. RelWithDebInfo
  --   Shared libraries ........... OFF
  --   Character type ............. char (UTF-8)
  -- 
  --   Build documentation ........ OFF
  --   Build examples ............. ON
  --   Build fuzzers .............. OFF
  --   Build tests ................ ON
  --   Build tools (xmlwf) ........ ON
  --   Build pkg-config file ...... ON
  --   Install files .............. ON
  -- 
  --   Features
  --     // Advanced options, changes not advised
  --     Attributes info .......... OFF
  --     Context bytes ............ 1024
  --     DTD support .............. ON
  --     Large size ............... OFF
  --     Minimum size ............. OFF
  --     Namespace support ........ ON
  -- 
  --   Entropy sources
  --     getrandom ................ 
  --     syscall SYS_getrandom .... 1
  --     libbsd ................... OFF
  --     /dev/random .............. ON
  -- 
  -- ===========================================================================
  -- Looking for C++ include fnmatch.h
  -- Looking for C++ include fnmatch.h - found
  -- Check size of uint32_t
  -- Check size of uint32_t - done
  -- Looking for strtoll
  -- Looking for strtoll - found
  -- Could NOT find PythonInterp: Found unsuitable version "3.5.3", but required is at least "3.8" (found /usr/bin/python3)
  -- Configuring incomplete, errors occurred!
  See also "/home/vagrant/build/app.organicmaps/android/nativeOutputs/RelWithDebInfo/68e2x1y5/armeabi-v7a/CMakeFiles/CMakeOutput.log".
  See also "/home/vagrant/build/app.organicmaps/android/nativeOutputs/RelWithDebInfo/68e2x1y5/armeabi-v7a/CMakeFiles/CMakeError.log".
  
  Setting PLATFORM_ANDROID to true
  Build type: RelWithDebInfo
  Doing nothing, because we know nothing about developer frameworks dir
  SKIP_TESTS: Skipping subdirectory bsdiff/bsdiff_tests
  SKIP_TESTS: Skipping subdirectory opening_hours_tests
  SKIP_TESTS: Skipping subdirectory opening_hours_integration_tests
  SKIP_TESTS: Skipping subdirectory opening_hours_supported_features_tests
  CMake Error at CMakeLists.txt:329 (message):
    Could not find python to use in qt/, shaders/ and 3party/.
  
  


* Try:
Run with --stacktrace option to get the stack trace. Run with --info or --debug option to get more log output. Run with --scan to get full insights.

* Get more help at https://help.gradle.org

BUILD FAILED in 38s
14 actionable tasks: 14 executed
==== detail end ====
2021-10-20 00:08:38,717 DEBUG: Error encoutered, stopping by user request.