ar.rulosoft.mimanganu/lastbuild 126

From F-Droid
Jump to: navigation, search

Installed Android Tools

Build Log

'Build.py failed on server for ar.rulosoft.mimanganu:1.126'

detail

[...]
anu/app/src/main/java/rapid/decoder/BitmapDecoder.java:484: error: cannot find symbol
    public abstract Bitmap createAndDraw(int width, int height, @NonNull Rect rectDest,
                                                                 ^
  symbol:   class NonNull
  location: class BitmapDecoder
/home/vagrant/build/ar.rulosoft.mimanganu/app/src/main/java/rapid/decoder/BitmapDecoder.java:485: error: cannot find symbol
                                         @Nullable Drawable background);
                                          ^
  symbol:   class Nullable
  location: class BitmapDecoder
/home/vagrant/build/ar.rulosoft.mimanganu/app/src/main/java/rapid/decoder/BitmapDecoder.java:498: error: cannot find symbol
    @NonNull
     ^
  symbol:   class NonNull
  location: class BitmapDecoder
/home/vagrant/build/ar.rulosoft.mimanganu/app/src/main/java/rapid/decoder/BitmapDecoder.java:750: error: cannot find symbol
    public static BitmapLoader from(@NonNull String uriOrPath) {
                                     ^
  symbol:   class NonNull
  location: class BitmapDecoder
/home/vagrant/build/ar.rulosoft.mimanganu/app/src/main/java/rapid/decoder/BitmapDecoder.java:754: error: cannot find symbol
    public static BitmapLoader from(@NonNull String uriOrPath, boolean useCache) {
                                     ^
  symbol:   class NonNull
  location: class BitmapDecoder
/home/vagrant/build/ar.rulosoft.mimanganu/app/src/main/java/rapid/decoder/BitmapDecoder.java:762: error: cannot find symbol
    public static BitmapLoader from(Context context, @NonNull String uri) {
                                                      ^
  symbol:   class NonNull
  location: class BitmapDecoder
/home/vagrant/build/ar.rulosoft.mimanganu/app/src/main/java/rapid/decoder/BitmapDecoder.java:780: error: cannot find symbol
    public static BitmapLoader from(@NonNull Uri uri) {
                                     ^
  symbol:   class NonNull
  location: class BitmapDecoder
/home/vagrant/build/ar.rulosoft.mimanganu/app/src/main/java/rapid/decoder/BitmapDecoder.java:784: error: cannot find symbol
    public static BitmapLoader from(@NonNull Uri uri, boolean useCache) {
                                     ^
  symbol:   class NonNull
  location: class BitmapDecoder
/home/vagrant/build/ar.rulosoft.mimanganu/app/src/main/java/rapid/decoder/BitmapDecoder.java:788: error: cannot find symbol
    public static BitmapLoader from(Context context, @NonNull final Uri uri) {
                                                      ^
  symbol:   class NonNull
  location: class BitmapDecoder
/home/vagrant/build/ar.rulosoft.mimanganu/app/src/main/java/rapid/decoder/BitmapDecoder.java:792: error: cannot find symbol
    public static BitmapLoader from(final Context context, @NonNull final Uri uri,
                                                            ^
  symbol:   class NonNull
  location: class BitmapDecoder
/home/vagrant/build/ar.rulosoft.mimanganu/app/src/main/java/rapid/decoder/BitmapDecoder.java:901: error: cannot find symbol
    public static BitmapDecoder from(@NonNull Bitmap bitmap) {
                                      ^
  symbol:   class NonNull
  location: class BitmapDecoder
/home/vagrant/build/ar.rulosoft.mimanganu/app/src/main/java/rapid/decoder/Decodable.java:121: error: cannot find symbol
    public void decode(@NonNull OnBitmapDecodedListener listener) {
                        ^
  symbol:   class NonNull
  location: class Decodable
/home/vagrant/build/ar.rulosoft.mimanganu/app/src/main/java/rapid/decoder/Decodable.java:125: error: cannot find symbol
    public void decode(@NonNull Object key, @NonNull OnBitmapDecodedListener listener) {
                        ^
  symbol:   class NonNull
  location: class Decodable
/home/vagrant/build/ar.rulosoft.mimanganu/app/src/main/java/rapid/decoder/Decodable.java:125: error: cannot find symbol
    public void decode(@NonNull Object key, @NonNull OnBitmapDecodedListener listener) {
                                             ^
  symbol:   class NonNull
  location: class Decodable
/home/vagrant/build/ar.rulosoft.mimanganu/app/src/main/java/rapid/decoder/Decodable.java:153: error: cannot find symbol
    @Nullable
     ^
  symbol:   class Nullable
  location: class Decodable
/home/vagrant/build/ar.rulosoft.mimanganu/app/src/main/java/rapid/decoder/TwiceReadableInputStream.java:110: error: cannot find symbol
	public int read(@NonNull byte[] buffer, int byteOffset, int byteCount)
	                 ^
  symbol:   class NonNull
  location: class TwiceReadableInputStream
/home/vagrant/build/ar.rulosoft.mimanganu/app/src/main/java/rapid/decoder/binder/ViewBinder.java:58: error: cannot find symbol
    @Nullable
     ^
  symbol:   class Nullable
  location: class ViewBinder<T>
  where T is a type-variable:
    T extends View declared in class ViewBinder
/home/vagrant/build/ar.rulosoft.mimanganu/app/src/main/java/rapid/decoder/binder/ViewBinder.java:64: error: cannot find symbol
    public Drawable createDrawable(@NonNull Context context, @Nullable Bitmap bitmap) {
                                    ^
  symbol:   class NonNull
  location: class ViewBinder<T>
  where T is a type-variable:
    T extends View declared in class ViewBinder
/home/vagrant/build/ar.rulosoft.mimanganu/app/src/main/java/rapid/decoder/binder/ViewBinder.java:64: error: cannot find symbol
    public Drawable createDrawable(@NonNull Context context, @Nullable Bitmap bitmap) {
                                                              ^
  symbol:   class Nullable
  location: class ViewBinder<T>
  where T is a type-variable:
    T extends View declared in class ViewBinder
/home/vagrant/build/ar.rulosoft.mimanganu/app/src/main/java/rapid/decoder/binder/ViewBinder.java:63: error: cannot find symbol
    @Nullable
     ^
  symbol:   class Nullable
  location: class ViewBinder<T>
  where T is a type-variable:
    T extends View declared in class ViewBinder
/home/vagrant/build/ar.rulosoft.mimanganu/app/src/main/java/rapid/decoder/binder/ViewBinder.java:208: error: cannot find symbol
    @NonNull
     ^
  symbol:   class NonNull
  location: class ViewBinder<T>
  where T is a type-variable:
    T extends View declared in class ViewBinder
/home/vagrant/build/ar.rulosoft.mimanganu/app/src/main/java/rapid/decoder/ViewFrameBuilder.java:28: error: cannot find symbol
    public ViewFrameBuilder(@NonNull BitmapDecoder decoder, @NonNull ViewBinder<?> binder,
                             ^
  symbol:   class NonNull
  location: class ViewFrameBuilder
/home/vagrant/build/ar.rulosoft.mimanganu/app/src/main/java/rapid/decoder/ViewFrameBuilder.java:28: error: cannot find symbol
    public ViewFrameBuilder(@NonNull BitmapDecoder decoder, @NonNull ViewBinder<?> binder,
                                                             ^
  symbol:   class NonNull
  location: class ViewFrameBuilder
/home/vagrant/build/ar.rulosoft.mimanganu/app/src/main/java/rapid/decoder/ViewFrameBuilder.java:29: error: cannot find symbol
                            @NonNull FramingMethod framing) {
                             ^
  symbol:   class NonNull
  location: class ViewFrameBuilder
/home/vagrant/build/ar.rulosoft.mimanganu/app/src/main/java/rapid/decoder/ViewFrameBuilder.java:61: error: cannot find symbol
    @Nullable
     ^
  symbol:   class Nullable
  location: class ViewFrameBuilder
/home/vagrant/build/ar.rulosoft.mimanganu/app/src/main/java/rapid/decoder/frame/FramedDecoder.java:44: error: cannot find symbol
                                      @Nullable Rect outSrc, @Nullable Rect outDest);
                                       ^
  symbol:   class Nullable
  location: class FramedDecoder
/home/vagrant/build/ar.rulosoft.mimanganu/app/src/main/java/rapid/decoder/frame/FramedDecoder.java:44: error: cannot find symbol
                                      @Nullable Rect outSrc, @Nullable Rect outDest);
                                                              ^
  symbol:   class Nullable
  location: class FramedDecoder
/home/vagrant/build/ar.rulosoft.mimanganu/app/src/main/java/rapid/decoder/Decodable.java:21: error: cannot find symbol
        void onBitmapDecoded(@Nullable Bitmap bitmap, @Nullable CacheSource cacheSource);
                              ^
  symbol:   class Nullable
  location: interface OnBitmapDecodedListener
/home/vagrant/build/ar.rulosoft.mimanganu/app/src/main/java/rapid/decoder/Decodable.java:21: error: cannot find symbol
        void onBitmapDecoded(@Nullable Bitmap bitmap, @Nullable CacheSource cacheSource);
                                                       ^
  symbol:   class Nullable
  location: interface OnBitmapDecodedListener
/home/vagrant/build/ar.rulosoft.mimanganu/app/src/main/java/rapid/decoder/cache/TransactionOutputStream.java:41: error: cannot find symbol
	public void write(@NonNull byte[] buffer, int offset, int count)
	                   ^
  symbol:   class NonNull
  location: class TransactionOutputStream
/home/vagrant/build/ar.rulosoft.mimanganu/app/src/main/java/rapid/decoder/cache/TransactionOutputStream.java:53: error: cannot find symbol
	public void write(@NonNull byte[] buffer) throws IOException {
	                   ^
  symbol:   class NonNull
  location: class TransactionOutputStream
/home/vagrant/build/ar.rulosoft.mimanganu/app/src/main/java/rapid/decoder/binder/DrawableInflater.java:8: error: cannot find symbol
    @Nullable
     ^
  symbol:   class Nullable
  location: interface DrawableInflater
/home/vagrant/build/ar.rulosoft.mimanganu/app/src/main/java/rapid/decoder/binder/DrawableCreator.java:11: error: cannot find symbol
    Drawable createDrawable(@NonNull Context context, @NonNull Bitmap d);
                             ^
  symbol:   class NonNull
  location: interface DrawableCreator
/home/vagrant/build/ar.rulosoft.mimanganu/app/src/main/java/rapid/decoder/binder/DrawableCreator.java:11: error: cannot find symbol
    Drawable createDrawable(@NonNull Context context, @NonNull Bitmap d);
                                                       ^
  symbol:   class NonNull
  location: interface DrawableCreator
/home/vagrant/build/ar.rulosoft.mimanganu/app/src/main/java/rapid/decoder/binder/DrawableCreator.java:10: error: cannot find symbol
    @Nullable
     ^
  symbol:   class Nullable
  location: interface DrawableCreator
/home/vagrant/build/ar.rulosoft.mimanganu/app/src/main/java/rapid/decoder/AssetBitmapLoader.java:20: error: cannot find symbol
	public AssetBitmapLoader(Context context, @NonNull String path) {
	                                           ^
  symbol:   class NonNull
  location: class AssetBitmapLoader
/home/vagrant/build/ar.rulosoft.mimanganu/app/src/main/java/rapid/decoder/AssetBitmapLoader.java:57: error: cannot find symbol
	@NonNull
	 ^
  symbol:   class NonNull
  location: class AssetBitmapLoader
/home/vagrant/build/ar.rulosoft.mimanganu/app/src/main/java/rapid/decoder/BitmapTransformer.java:84: error: cannot find symbol
    public void decode(@NonNull OnBitmapDecodedListener listener) {
                        ^
  symbol:   class NonNull
  location: class BitmapTransformer
/home/vagrant/build/ar.rulosoft.mimanganu/app/src/main/java/rapid/decoder/BitmapTransformer.java:116: error: cannot find symbol
    @NonNull
     ^
  symbol:   class NonNull
  location: class BitmapTransformer
/home/vagrant/build/ar.rulosoft.mimanganu/app/src/main/java/rapid/decoder/BitmapTransformer.java:139: error: cannot find symbol
    public BitmapDecoder region(@NonNull Rect region) {
                                 ^
  symbol:   class NonNull
  location: class BitmapTransformer
/home/vagrant/build/ar.rulosoft.mimanganu/app/src/main/java/rapid/decoder/BitmapTransformer.java:156: error: cannot find symbol
    public Bitmap createAndDraw(int width, int height, @NonNull Rect rectDest, @Nullable Drawable
                                                        ^
  symbol:   class NonNull
  location: class BitmapTransformer
/home/vagrant/build/ar.rulosoft.mimanganu/app/src/main/java/rapid/decoder/BitmapTransformer.java:156: error: cannot find symbol
    public Bitmap createAndDraw(int width, int height, @NonNull Rect rectDest, @Nullable Drawable
                                                                                ^
  symbol:   class Nullable
  location: class BitmapTransformer
/home/vagrant/build/ar.rulosoft.mimanganu/app/src/main/java/rapid/decoder/BackgroundTaskManager.java:21: error: cannot find symbol
    public static BackgroundTask register(@NonNull Object key) {
                                           ^
  symbol:   class NonNull
  location: class BackgroundTaskManager
/home/vagrant/build/ar.rulosoft.mimanganu/app/src/main/java/rapid/decoder/BackgroundTaskManager.java:20: error: cannot find symbol
    @NonNull
     ^
  symbol:   class NonNull
  location: class BackgroundTaskManager
/home/vagrant/build/ar.rulosoft.mimanganu/app/src/main/java/rapid/decoder/StreamBitmapLoader.java:93: error: cannot find symbol
	@NonNull
	 ^
  symbol:   class NonNull
  location: class StreamBitmapLoader
/home/vagrant/build/ar.rulosoft.mimanganu/app/src/main/java/rapid/decoder/StreamOpener.java:8: error: cannot find symbol
    @Nullable
     ^
  symbol:   class Nullable
  location: interface StreamOpener
/home/vagrant/build/ar.rulosoft.mimanganu/app/src/main/java/rapid/decoder/LazyInputStream.java:49: error: cannot find symbol
    public int read(@NonNull byte[] buffer) throws IOException {
                     ^
  symbol:   class NonNull
  location: class LazyInputStream
/home/vagrant/build/ar.rulosoft.mimanganu/app/src/main/java/rapid/decoder/LazyInputStream.java:54: error: cannot find symbol
    public int read(@NonNull byte[] buffer, int byteOffset, int byteCount)
                     ^
  symbol:   class NonNull
  location: class LazyInputStream

> Task :fakegps:mergeReleaseShaders
> Task :fakegps:compileReleaseShaders
> Task :fakegps:generateReleaseAssets
> Task :fakegps:packageReleaseAssets
> Task :imageviewtouchlibrary:mergeReleaseShaders
> Task :imageviewtouchlibrary:compileReleaseShaders
> Task :imageviewtouchlibrary:generateReleaseAssets
> Task :imageviewtouchlibrary:packageReleaseAssets
> Task :fakegps:processReleaseJavaRes NO-SOURCE
> Task :imageviewtouchlibrary:processReleaseJavaRes NO-SOURCE
> Task :fakegps:bundleLibResRelease
> Task :imageviewtouchlibrary:bundleLibResRelease
> Task :imageviewtouchlibrary:mergeReleaseJniLibFolders
> Task :fakegps:mergeReleaseJniLibFolders
> Task :fakegps:mergeReleaseNativeLibs
> Task :imageviewtouchlibrary:mergeReleaseNativeLibs
> Task :fakegps:stripReleaseDebugSymbols
> Task :imageviewtouchlibrary:stripReleaseDebugSymbols
> Task :imageviewtouchlibrary:transformNativeLibsWithIntermediateJniLibsForRelease
> Task :fakegps:transformNativeLibsWithIntermediateJniLibsForRelease

> Task :app:compileFdroidReleaseJavaWithJavac FAILED
Note: Some input files use or override a deprecated API.
Note: Recompile with -Xlint:deprecation for details.
100 errors

FAILURE: Build failed with an exception.

* What went wrong:
Execution failed for task ':app:compileFdroidReleaseJavaWithJavac'.
> Compilation failed; see the compiler error output for details.

* Try:
Run with --stacktrace option to get the stack trace. Run with --info or --debug option to get more log output. Run with --scan to get full insights.

* Get more help at https://help.gradle.org

Deprecated Gradle features were used in this build, making it incompatible with Gradle 6.0.
Use '--warning-mode all' to show the individual deprecation warnings.
See https://docs.gradle.org/5.4.1/userguide/command_line_interface.html#sec:command_line_warnings

BUILD FAILED in 1m 5s
51 actionable tasks: 51 executed
==== detail end ====