com.etesync.syncadapter/lastbuild 91

From F-Droid
Jump to: navigation, search

Installed Android Tools

Build Log

'Build.py failed on server for com.etesync.syncadapter:1.9.1'

detail

[...]
rc/main/java/com/etesync/syncadapter/ui/ViewCollectionActivity.kt: (148, 25): Parameter 'item' is never used
w: /home/vagrant/build/com.etesync.syncadapter/app/src/main/java/com/etesync/syncadapter/ui/ViewCollectionActivity.kt: (187, 40): 'release(): Boolean' is deprecated. Deprecated in Java
w: /home/vagrant/build/com.etesync.syncadapter/app/src/main/java/com/etesync/syncadapter/ui/ViewCollectionActivity.kt: (220, 40): 'release(): Boolean' is deprecated. Deprecated in Java
w: /home/vagrant/build/com.etesync.syncadapter/app/src/main/java/com/etesync/syncadapter/ui/importlocal/AccountResolver.kt: (19, 13): Name shadowed: accountName
w: /home/vagrant/build/com.etesync.syncadapter/app/src/main/java/com/etesync/syncadapter/ui/importlocal/CalendarAccount.kt: (87, 35): 'release(): Boolean' is deprecated. Deprecated in Java
w: /home/vagrant/build/com.etesync.syncadapter/app/src/main/java/com/etesync/syncadapter/ui/importlocal/CalendarAccount.kt: (109, 23): 'release(): Boolean' is deprecated. Deprecated in Java
w: /home/vagrant/build/com.etesync.syncadapter/app/src/main/java/com/etesync/syncadapter/ui/importlocal/ImportActivity.kt: (119, 19): 'onAttach(Activity!): Unit' is deprecated. Deprecated in Java
w: /home/vagrant/build/com.etesync.syncadapter/app/src/main/java/com/etesync/syncadapter/ui/importlocal/ImportFragment.kt: (8, 20): 'ProgressDialog' is deprecated. Deprecated in Java
w: /home/vagrant/build/com.etesync.syncadapter/app/src/main/java/com/etesync/syncadapter/ui/importlocal/ImportFragment.kt: (71, 24): 'ProgressDialog' is deprecated. Deprecated in Java
w: /home/vagrant/build/com.etesync.syncadapter/app/src/main/java/com/etesync/syncadapter/ui/importlocal/ImportFragment.kt: (77, 35): 'ProgressDialog' is deprecated. Deprecated in Java
w: /home/vagrant/build/com.etesync.syncadapter/app/src/main/java/com/etesync/syncadapter/ui/importlocal/ImportFragment.kt: (92, 45): 'ProgressDialog' is deprecated. Deprecated in Java
w: /home/vagrant/build/com.etesync.syncadapter/app/src/main/java/com/etesync/syncadapter/ui/importlocal/ImportFragment.kt: (100, 32): 'ProgressDialog' is deprecated. Deprecated in Java
w: /home/vagrant/build/com.etesync.syncadapter/app/src/main/java/com/etesync/syncadapter/ui/importlocal/ImportFragment.kt: (190, 70): 'ProgressDialog' is deprecated. Deprecated in Java
w: /home/vagrant/build/com.etesync.syncadapter/app/src/main/java/com/etesync/syncadapter/ui/importlocal/ImportFragment.kt: (199, 40): 'ProgressDialog' is deprecated. Deprecated in Java
w: /home/vagrant/build/com.etesync.syncadapter/app/src/main/java/com/etesync/syncadapter/ui/importlocal/ImportFragment.kt: (398, 30): 'release(): Boolean' is deprecated. Deprecated in Java
w: /home/vagrant/build/com.etesync.syncadapter/app/src/main/java/com/etesync/syncadapter/ui/importlocal/LocalCalendarImportFragment.kt: (4, 20): 'ProgressDialog' is deprecated. Deprecated in Java
w: /home/vagrant/build/com.etesync.syncadapter/app/src/main/java/com/etesync/syncadapter/ui/importlocal/LocalCalendarImportFragment.kt: (58, 48): Parameter 'aExpandableListView' is never used, could be renamed to _
w: /home/vagrant/build/com.etesync.syncadapter/app/src/main/java/com/etesync/syncadapter/ui/importlocal/LocalCalendarImportFragment.kt: (58, 69): Parameter 'aView' is never used, could be renamed to _
w: /home/vagrant/build/com.etesync.syncadapter/app/src/main/java/com/etesync/syncadapter/ui/importlocal/LocalCalendarImportFragment.kt: (58, 106): Parameter 'aL' is never used, could be renamed to _
w: /home/vagrant/build/com.etesync.syncadapter/app/src/main/java/com/etesync/syncadapter/ui/importlocal/LocalCalendarImportFragment.kt: (92, 17): Name shadowed: convertView
w: /home/vagrant/build/com.etesync.syncadapter/app/src/main/java/com/etesync/syncadapter/ui/importlocal/LocalCalendarImportFragment.kt: (133, 17): Name shadowed: convertView
w: /home/vagrant/build/com.etesync.syncadapter/app/src/main/java/com/etesync/syncadapter/ui/importlocal/LocalCalendarImportFragment.kt: (171, 46): 'ProgressDialog' is deprecated. Deprecated in Java
w: /home/vagrant/build/com.etesync.syncadapter/app/src/main/java/com/etesync/syncadapter/ui/importlocal/LocalCalendarImportFragment.kt: (174, 30): 'ProgressDialog' is deprecated. Deprecated in Java
w: /home/vagrant/build/com.etesync.syncadapter/app/src/main/java/com/etesync/syncadapter/ui/importlocal/LocalCalendarImportFragment.kt: (181, 45): 'ProgressDialog' is deprecated. Deprecated in Java
w: /home/vagrant/build/com.etesync.syncadapter/app/src/main/java/com/etesync/syncadapter/ui/importlocal/LocalCalendarImportFragment.kt: (211, 52): Unnecessary non-null assertion (!!) on a non-null receiver of type CollectionInfo
w: /home/vagrant/build/com.etesync.syncadapter/app/src/main/java/com/etesync/syncadapter/ui/importlocal/LocalContactImportFragment.kt: (4, 20): 'ProgressDialog' is deprecated. Deprecated in Java
w: /home/vagrant/build/com.etesync.syncadapter/app/src/main/java/com/etesync/syncadapter/ui/importlocal/LocalContactImportFragment.kt: (45, 19): Type mismatch: inferred type is Account? but Account was expected
w: /home/vagrant/build/com.etesync.syncadapter/app/src/main/java/com/etesync/syncadapter/ui/importlocal/LocalContactImportFragment.kt: (95, 18): 'release(): Boolean' is deprecated. Deprecated in Java
w: /home/vagrant/build/com.etesync.syncadapter/app/src/main/java/com/etesync/syncadapter/ui/importlocal/LocalContactImportFragment.kt: (105, 46): 'ProgressDialog' is deprecated. Deprecated in Java
w: /home/vagrant/build/com.etesync.syncadapter/app/src/main/java/com/etesync/syncadapter/ui/importlocal/LocalContactImportFragment.kt: (108, 30): 'ProgressDialog' is deprecated. Deprecated in Java
w: /home/vagrant/build/com.etesync.syncadapter/app/src/main/java/com/etesync/syncadapter/ui/importlocal/LocalContactImportFragment.kt: (115, 45): 'ProgressDialog' is deprecated. Deprecated in Java
w: /home/vagrant/build/com.etesync.syncadapter/app/src/main/java/com/etesync/syncadapter/ui/importlocal/ResultFragment.kt: (39, 63): Parameter 'dialog' is never used, could be renamed to _
w: /home/vagrant/build/com.etesync.syncadapter/app/src/main/java/com/etesync/syncadapter/ui/importlocal/ResultFragment.kt: (39, 71): Parameter 'which' is never used, could be renamed to _
w: /home/vagrant/build/com.etesync.syncadapter/app/src/main/java/com/etesync/syncadapter/ui/importlocal/ResultFragment.kt: (42, 64): Parameter 'dialog' is never used, could be renamed to _
w: /home/vagrant/build/com.etesync.syncadapter/app/src/main/java/com/etesync/syncadapter/ui/importlocal/ResultFragment.kt: (42, 72): Parameter 'which' is never used, could be renamed to _
w: /home/vagrant/build/com.etesync.syncadapter/app/src/main/java/com/etesync/syncadapter/ui/importlocal/ResultFragment.kt: (51, 63): Parameter 'dialog' is never used, could be renamed to _
w: /home/vagrant/build/com.etesync.syncadapter/app/src/main/java/com/etesync/syncadapter/ui/importlocal/ResultFragment.kt: (51, 71): Parameter 'which' is never used, could be renamed to _
w: /home/vagrant/build/com.etesync.syncadapter/app/src/main/java/com/etesync/syncadapter/ui/journalviewer/ListEntriesFragment.kt: (123, 17): Name shadowed: content
w: /home/vagrant/build/com.etesync.syncadapter/app/src/main/java/com/etesync/syncadapter/ui/setup/DetectConfigurationFragment.kt: (12, 20): 'ProgressDialog' is deprecated. Deprecated in Java
w: /home/vagrant/build/com.etesync.syncadapter/app/src/main/java/com/etesync/syncadapter/ui/setup/DetectConfigurationFragment.kt: (29, 24): 'ProgressDialog' is deprecated. Deprecated in Java
w: /home/vagrant/build/com.etesync.syncadapter/app/src/main/java/com/etesync/syncadapter/ui/setup/DetectConfigurationFragment.kt: (41, 9): 'getter for loaderManager: LoaderManager!' is deprecated. Deprecated in Java
w: /home/vagrant/build/com.etesync.syncadapter/app/src/main/java/com/etesync/syncadapter/ui/setup/DetectConfigurationFragment.kt: (77, 67): Parameter 'dialog' is never used, could be renamed to _
w: /home/vagrant/build/com.etesync.syncadapter/app/src/main/java/com/etesync/syncadapter/ui/setup/DetectConfigurationFragment.kt: (77, 75): Parameter 'which' is never used, could be renamed to _
w: /home/vagrant/build/com.etesync.syncadapter/app/src/main/java/com/etesync/syncadapter/ui/setup/DetectConfigurationFragment.kt: (82, 63): Parameter 'dialog' is never used, could be renamed to _
w: /home/vagrant/build/com.etesync.syncadapter/app/src/main/java/com/etesync/syncadapter/ui/setup/DetectConfigurationFragment.kt: (82, 71): Parameter 'which' is never used, could be renamed to _
w: /home/vagrant/build/com.etesync.syncadapter/app/src/main/java/com/etesync/syncadapter/ui/setup/LoginActivity.kt: (43, 18): Parameter 'item' is never used
w: /home/vagrant/build/com.etesync.syncadapter/app/src/main/java/com/etesync/syncadapter/ui/setup/LoginCredentialsChangeFragment.kt: (13, 20): 'ProgressDialog' is deprecated. Deprecated in Java
w: /home/vagrant/build/com.etesync.syncadapter/app/src/main/java/com/etesync/syncadapter/ui/setup/LoginCredentialsChangeFragment.kt: (34, 24): 'ProgressDialog' is deprecated. Deprecated in Java
w: /home/vagrant/build/com.etesync.syncadapter/app/src/main/java/com/etesync/syncadapter/ui/setup/LoginCredentialsChangeFragment.kt: (46, 9): 'getter for loaderManager: LoaderManager!' is deprecated. Deprecated in Java
w: /home/vagrant/build/com.etesync.syncadapter/app/src/main/java/com/etesync/syncadapter/ui/setup/LoginCredentialsChangeFragment.kt: (90, 67): Parameter 'dialog' is never used, could be renamed to _
w: /home/vagrant/build/com.etesync.syncadapter/app/src/main/java/com/etesync/syncadapter/ui/setup/LoginCredentialsChangeFragment.kt: (90, 75): Parameter 'which' is never used, could be renamed to _
w: /home/vagrant/build/com.etesync.syncadapter/app/src/main/java/com/etesync/syncadapter/ui/setup/LoginCredentialsChangeFragment.kt: (95, 63): Parameter 'dialog' is never used, could be renamed to _
w: /home/vagrant/build/com.etesync.syncadapter/app/src/main/java/com/etesync/syncadapter/ui/setup/LoginCredentialsChangeFragment.kt: (95, 71): Parameter 'which' is never used, could be renamed to _
w: /home/vagrant/build/com.etesync.syncadapter/app/src/main/java/com/etesync/syncadapter/ui/setup/SetupEncryptionFragment.kt: (15, 20): 'ProgressDialog' is deprecated. Deprecated in Java
w: /home/vagrant/build/com.etesync.syncadapter/app/src/main/java/com/etesync/syncadapter/ui/setup/SetupEncryptionFragment.kt: (41, 24): 'ProgressDialog' is deprecated. Deprecated in Java
w: /home/vagrant/build/com.etesync.syncadapter/app/src/main/java/com/etesync/syncadapter/ui/setup/SetupEncryptionFragment.kt: (141, 17): Condition 'config.cardDAV != null' is always 'true'
w: /home/vagrant/build/com.etesync.syncadapter/app/src/main/java/com/etesync/syncadapter/ui/setup/SetupEncryptionFragment.kt: (151, 17): Condition 'config.calDAV != null' is always 'true'
w: /home/vagrant/build/com.etesync.syncadapter/app/src/main/java/com/etesync/syncadapter/ui/setup/SetupUserInfoFragment.kt: (5, 20): 'ProgressDialog' is deprecated. Deprecated in Java
w: /home/vagrant/build/com.etesync.syncadapter/app/src/main/java/com/etesync/syncadapter/ui/setup/SetupUserInfoFragment.kt: (27, 24): 'ProgressDialog' is deprecated. Deprecated in Java
w: /home/vagrant/build/com.etesync.syncadapter/app/src/main/java/com/etesync/syncadapter/utils/AndroidCompat.kt: (12, 28): 'removeAccount(Account!, AccountManagerCallback<Boolean!>!, Handler!): AccountManagerFuture<Boolean!>!' is deprecated. Deprecated in Java
w: /home/vagrant/build/com.etesync.syncadapter/app/src/main/java/com/etesync/syncadapter/utils/LanguageUtils.kt: (29, 38): Unchecked cast: Array<String?> to Array<String>
w: /home/vagrant/build/com.etesync.syncadapter/app/src/main/java/com/etesync/syncadapter/utils/LanguageUtils.kt: (29, 69): Unchecked cast: Array<String?> to Array<String>
w: /home/vagrant/build/com.etesync.syncadapter/app/src/main/java/com/etesync/syncadapter/utils/LanguageUtils.kt: (40, 13): Name shadowed: context
w: /home/vagrant/build/com.etesync.syncadapter/app/src/main/java/com/etesync/syncadapter/utils/LanguageUtils.kt: (49, 20): 'locale: Locale!' is deprecated. Deprecated in Java
w: /home/vagrant/build/com.etesync.syncadapter/app/src/main/java/com/etesync/syncadapter/utils/LanguageUtils.kt: (50, 31): 'updateConfiguration(Configuration!, DisplayMetrics!): Unit' is deprecated. Deprecated in Java
w: /home/vagrant/build/com.etesync.syncadapter/app/src/main/java/com/etesync/syncadapter/utils/LanguageUtils.kt: (53, 46): 'updateConfiguration(Configuration!, DisplayMetrics!): Unit' is deprecated. Deprecated in Java

> Task :app:javaPreCompileRelease

> Task :app:compileReleaseJavaWithJavac
Note: /home/vagrant/build/com.etesync.syncadapter/app/build/generated/source/kapt/release/com/etesync/syncadapter/model/JournalEntity.java uses or overrides a deprecated API.
Note: Recompile with -Xlint:deprecation for details.
Note: Some input files use unchecked or unsafe operations.
Note: Recompile with -Xlint:unchecked for details.

> Task :app:compileReleaseSources
> Task :cert4android:prepareLintJarForPublish
> Task :ical4android:prepareLintJarForPublish
> Task :vcard4android:prepareLintJarForPublish

> Task :app:lintVitalRelease
Calling mockable JAR artifact transform to create file: /home/vagrant/.gradle/caches/transforms-2/files-2.1/dbc75ecb47033b13b190b224fd45faf2/android.jar with input /home/vagrant/android-sdk/platforms/android-28/android.jar
/home/vagrant/build/com.etesync.syncadapter/app/src/main/AndroidManifest.xml:127: Error: Resources referenced from the manifest cannot vary by configuration (except for version qualifiers, e.g. -v21). Found variation in nb-rNO [ManifestResource]
            android:authorities="@string/address_books_authority"
                                 ~~~~~~~~~~~~~~~~~~~~~~~~~~~~~~~
    /home/vagrant/build/com.etesync.syncadapter/app/src/main/res/values-nb-rNO/strings.xml:17: This value will not be used
/home/vagrant/build/com.etesync.syncadapter/app/src/main/AndroidManifest.xml:269: Error: Resources referenced from the manifest cannot vary by configuration (except for version qualifiers, e.g. -v21). Found variation in nb-rNO [ManifestResource]
            android:authorities="@string/authority_log_provider"
                                 ~~~~~~~~~~~~~~~~~~~~~~~~~~~~~~
    /home/vagrant/build/com.etesync.syncadapter/app/src/main/res/values-nb-rNO/strings.xml:332: This value will not be used

   Explanation for issues of type "ManifestResource":
   Elements in the manifest can reference resources, but those resources
   cannot vary across configurations (except as a special case, by version,
   and except for a few specific package attributes such as the application
   title and icon).

2 errors, 0 warnings

> Task :app:lintVitalRelease FAILED

FAILURE: Build failed with an exception.

* What went wrong:
Execution failed for task ':app:lintVitalRelease'.
> Lint found fatal errors while assembling a release target.
  
  To proceed, either fix the issues identified by lint, or modify your build script as follows:
  ...
  android {
      lintOptions {
          checkReleaseBuilds false
          // Or, if you prefer, you can continue to check for errors in release builds,
          // but continue the build even when errors are found:
          abortOnError false
      }
  }
  ...

* Try:
Run with --stacktrace option to get the stack trace. Run with --info or --debug option to get more log output. Run with --scan to get full insights.

* Get more help at https://help.gradle.org

Deprecated Gradle features were used in this build, making it incompatible with Gradle 6.0.
Use '--warning-mode all' to show the individual deprecation warnings.
See https://docs.gradle.org/5.1.1/userguide/command_line_interface.html#sec:command_line_warnings

BUILD FAILED in 5m 33s
64 actionable tasks: 64 executed
==== detail end ====