com.nextcloud.client/lastbuild 30100090

From F-Droid
Jump to: navigation, search

Installed Android Tools

Build Log

'Build.py failed on server for com.nextcloud.client:3.10.0'

detail

[...]
oving gplay.gradle
INFO: Cleaning Gradle project...
INFO: Scanning source for common problems...
INFO: Removing gradle-wrapper.jar at gradle/wrapper/gradle-wrapper.jar
INFO: Removing binary at src/androidTest/assets/srEPevoPqPZpPEaeDnS3
INFO: Removing binary at src/androidTest/assets/n9WXAIXO2wRY4R8nXwmo
INFO: Removing binary at src/androidTest/assets/encrypted/n9WXAIXO2wRY4R8nXwmo
INFO: Removing binary at src/androidTest/assets/encrypted/ia7OEEEyXMoRa1QWQk8r
INFO: Creating source tarball...
INFO: Building Gradle project...
ERROR: Could not build app com.nextcloud.client: Build failed for com.nextcloud.client:3.10.0
==== detail begin ====
Found 5.4.1 via distributionUrl
Running /opt/gradle/versions/5.4.1/bin/gradle assembleGenericRelease

> Configure project :
WARNING: Configuration 'androidTestCompile' is obsolete and has been replaced with 'androidTestImplementation'.
It will be removed soon. For more information see: http://d.android.com/r/tools/update-dependency-configurations.html
com.nextcloud.client: 'annotationProcessor' dependencies won't be recognized as kapt annotation processors. Please change the configuration name to 'kapt' for these artifacts: 'org.projectlombok:lombok:1.18.10'.

> Task :preBuild UP-TO-DATE
> Task :preGenericReleaseBuild UP-TO-DATE
> Task :compileGenericReleaseAidl
> Task :compileGenericReleaseRenderscript NO-SOURCE
> Task :checkGenericReleaseManifest
> Task :generateGenericReleaseBuildConfig
> Task :prepareLintJar
> Task :prepareLintJarForPublish
> Task :generateGenericReleaseSources
> Task :dataBindingExportBuildInfoGenericRelease
> Task :dataBindingMergeDependencyArtifactsGenericRelease
> Task :dataBindingMergeGenClassesGenericRelease
> Task :generateGenericReleaseResValues
> Task :generateGenericReleaseResources
> Task :mergeGenericReleaseResources
> Task :dataBindingGenBaseClassesGenericRelease
> Task :dataBindingExportFeaturePackageIdsGenericRelease
> Task :mainApkListPersistenceGenericRelease
> Task :createGenericReleaseCompatibleScreenManifests
> Task :processGenericReleaseManifest
warn: removing resource com.nextcloud.client:string/actionbar_open_as_richdocument_parameter without required default value.
warn: removing resource com.nextcloud.client:string/authentication_exception without required default value.
warn: removing resource com.nextcloud.client:string/copy_internal_link without required default value.
warn: removing resource com.nextcloud.client:string/copy_internal_link_subline without required default value.
warn: removing resource com.nextcloud.client:string/create_file_from_template without required default value.
warn: removing resource com.nextcloud.client:string/io_error without required default value.
warn: removing resource com.nextcloud.client:string/operation_canceled without required default value.

> Task :processGenericReleaseResources
> Task :kaptGenerateStubsGenericReleaseKotlin

> Task :kaptGenericReleaseKotlin
Annotation processors discovery from compile classpath is deprecated.
Set 'kapt.includeCompileClasspath = false' to disable discovery.
Run the build with '--info' for more details.
e: error: cannot load api descriptions from /home/vagrant/android-sdk/platform-tools/api/api-versions.xml java.lang.OutOfMemoryError: GC overhead limit exceeded
  	at android.databinding.tool.reflection.SdkUtil$ApiChecker.cacheKey(SdkUtil.java:178)
  	at android.databinding.tool.reflection.SdkUtil$ApiChecker.buildFullLookup(SdkUtil.java:156)
  	at android.databinding.tool.reflection.SdkUtil$ApiChecker.<init>(SdkUtil.java:124)
  	at android.databinding.tool.reflection.SdkUtil.create(SdkUtil.java:56)
  	at android.databinding.tool.Context.init(Context.kt:50)
  	at android.databinding.annotationprocessor.ProcessDataBinding.doProcess(ProcessDataBinding.java:110)
  	at android.databinding.annotationprocessor.ProcessDataBinding.process(ProcessDataBinding.java:88)
  	at org.jetbrains.kotlin.kapt3.base.incremental.IncrementalProcessor.process(incrementalProcessors.kt)
  	at org.jetbrains.kotlin.kapt3.base.ProcessorWrapper.process(annotationProcessing.kt:147)
  	at com.sun.tools.javac.processing.JavacProcessingEnvironment.callProcessor(JavacProcessingEnvironment.java:802)
  	at com.sun.tools.javac.processing.JavacProcessingEnvironment.access$200(JavacProcessingEnvironment.java:91)
  	at com.sun.tools.javac.processing.JavacProcessingEnvironment$DiscoveredProcessors$ProcessorStateIterator.runContributingProcs(JavacProcessingEnvironment.java:635)
  	at com.sun.tools.javac.processing.JavacProcessingEnvironment$Round.run(JavacProcessingEnvironment.java:1041)
  	at com.sun.tools.javac.processing.JavacProcessingEnvironment.doProcessing(JavacProcessingEnvironment.java:1206)
  	at com.sun.tools.javac.main.JavaCompiler.processAnnotations(JavaCompiler.java:1170)
  	at com.sun.tools.javac.main.JavaCompiler.processAnnotations(JavaCompiler.java:1068)
  	at org.jetbrains.kotlin.kapt3.base.AnnotationProcessingKt.doAnnotationProcessing(annotationProcessing.kt:79)
  	at org.jetbrains.kotlin.kapt3.base.AnnotationProcessingKt.doAnnotationProcessing$default(annotationProcessing.kt:35)
  	at org.jetbrains.kotlin.kapt3.AbstractKapt3Extension.runAnnotationProcessing(Kapt3Extension.kt:224)
  	at org.jetbrains.kotlin.kapt3.AbstractKapt3Extension.analysisCompleted(Kapt3Extension.kt:187)
  	at org.jetbrains.kotlin.kapt3.ClasspathBasedKapt3Extension.analysisCompleted(Kapt3Extension.kt:98)
  	at org.jetbrains.kotlin.cli.jvm.compiler.TopDownAnalyzerFacadeForJVM$analyzeFilesWithJavaIntegration$2.invoke(TopDownAnalyzerFacadeForJVM.kt:97)
  	at org.jetbrains.kotlin.cli.jvm.compiler.TopDownAnalyzerFacadeForJVM.analyzeFilesWithJavaIntegration(TopDownAnalyzerFacadeForJVM.kt:107)
  	at org.jetbrains.kotlin.cli.jvm.compiler.TopDownAnalyzerFacadeForJVM.analyzeFilesWithJavaIntegration$default(TopDownAnalyzerFacadeForJVM.kt:82)
  	at org.jetbrains.kotlin.cli.jvm.compiler.KotlinToJVMBytecodeCompiler$analyze$1.invoke(KotlinToJVMBytecodeCompiler.kt:557)
  	at org.jetbrains.kotlin.cli.jvm.compiler.KotlinToJVMBytecodeCompiler$analyze$1.invoke(KotlinToJVMBytecodeCompiler.kt:82)
  	at org.jetbrains.kotlin.cli.common.messages.AnalyzerWithCompilerReport.analyzeAndReport(AnalyzerWithCompilerReport.kt:107)
  	at org.jetbrains.kotlin.cli.jvm.compiler.KotlinToJVMBytecodeCompiler.analyze(KotlinToJVMBytecodeCompiler.kt:548)
  	at org.jetbrains.kotlin.cli.jvm.compiler.KotlinToJVMBytecodeCompiler.compileModules$cli(KotlinToJVMBytecodeCompiler.kt:177)
  	at org.jetbrains.kotlin.cli.jvm.K2JVMCompiler.doExecute(K2JVMCompiler.kt:165)
  	at org.jetbrains.kotlin.cli.jvm.K2JVMCompiler.doExecute(K2JVMCompiler.kt:55)
  	at org.jetbrains.kotlin.cli.common.CLICompiler.execImpl(CLICompiler.kt:84)
e: [kapt] An exception occurred: android.databinding.tool.util.LoggedErrorException: failure, see logs for details.
cannot load api descriptions from /home/vagrant/android-sdk/platform-tools/api/api-versions.xml java.lang.OutOfMemoryError: GC overhead limit exceeded
	at android.databinding.tool.reflection.SdkUtil$ApiChecker.cacheKey(SdkUtil.java:178)
	at android.databinding.tool.reflection.SdkUtil$ApiChecker.buildFullLookup(SdkUtil.java:156)
	at android.databinding.tool.reflection.SdkUtil$ApiChecker.<init>(SdkUtil.java:124)
	at android.databinding.tool.reflection.SdkUtil.create(SdkUtil.java:56)
	at android.databinding.tool.Context.init(Context.kt:50)
	at android.databinding.annotationprocessor.ProcessDataBinding.doProcess(ProcessDataBinding.java:110)
	at android.databinding.annotationprocessor.ProcessDataBinding.process(ProcessDataBinding.java:88)
	at org.jetbrains.kotlin.kapt3.base.incremental.IncrementalProcessor.process(incrementalProcessors.kt)
	at org.jetbrains.kotlin.kapt3.base.ProcessorWrapper.process(annotationProcessing.kt:147)
	at com.sun.tools.javac.processing.JavacProcessingEnvironment.callProcessor(JavacProcessingEnvironment.java:802)
	at com.sun.tools.javac.processing.JavacProcessingEnvironment.access$200(JavacProcessingEnvironment.java:91)
	at com.sun.tools.javac.processing.JavacProcessingEnvironment$DiscoveredProcessors$ProcessorStateIterator.runContributingProcs(JavacProcessingEnvironment.java:635)
	at com.sun.tools.javac.processing.JavacProcessingEnvironment$Round.run(JavacProcessingEnvironment.java:1041)
	at com.sun.tools.javac.processing.JavacProcessingEnvironment.doProcessing(JavacProcessingEnvironment.java:1206)
	at com.sun.tools.javac.main.JavaCompiler.processAnnotations(JavaCompiler.java:1170)
	at com.sun.tools.javac.main.JavaCompiler.processAnnotations(JavaCompiler.java:1068)
	at org.jetbrains.kotlin.kapt3.base.AnnotationProcessingKt.doAnnotationProcessing(annotationProcessing.kt:79)
	at org.jetbrains.kotlin.kapt3.base.AnnotationProcessingKt.doAnnotationProcessing$default(annotationProcessing.kt:35)
	at org.jetbrains.kotlin.kapt3.AbstractKapt3Extension.runAnnotationProcessing(Kapt3Extension.kt:224)
	at org.jetbrains.kotlin.kapt3.AbstractKapt3Extension.analysisCompleted(Kapt3Extension.kt:187)
	at org.jetbrains.kotlin.kapt3.ClasspathBasedKapt3Extension.analysisCompleted(Kapt3Extension.kt:98)
	at org.jetbrains.kotlin.cli.jvm.compiler.TopDownAnalyzerFacadeForJVM$analyzeFilesWithJavaIntegration$2.invoke(TopDownAnalyzerFacadeForJVM.kt:97)
	at org.jetbrains.kotlin.cli.jvm.compiler.TopDownAnalyzerFacadeForJVM.analyzeFilesWithJavaIntegration(TopDownAnalyzerFacadeForJVM.kt:107)
	at org.jetbrains.kotlin.cli.jvm.compiler.TopDownAnalyzerFacadeForJVM.analyzeFilesWithJavaIntegration$default(TopDownAnalyzerFacadeForJVM.kt:82)
	at org.jetbrains.kotlin.cli.jvm.compiler.KotlinToJVMBytecodeCompiler$analyze$1.invoke(KotlinToJVMBytecodeCompiler.kt:557)
	at org.jetbrains.kotlin.cli.jvm.compiler.KotlinToJVMBytecodeCompiler$analyze$1.invoke(KotlinToJVMBytecodeCompiler.kt:82)
	at org.jetbrains.kotlin.cli.common.messages.AnalyzerWithCompilerReport.analyzeAndReport(AnalyzerWithCompilerReport.kt:107)
	at org.jetbrains.kotlin.cli.jvm.compiler.KotlinToJVMBytecodeCompiler.analyze(KotlinToJVMBytecodeCompiler.kt:548)
	at org.jetbrains.kotlin.cli.jvm.compiler.KotlinToJVMBytecodeCompiler.compileModules$cli(KotlinToJVMBytecodeCompiler.kt:177)
	at org.jetbrains.kotlin.cli.jvm.K2JVMCompiler.doExecute(K2JVMCompiler.kt:165)
	at org.jetbrains.kotlin.cli.jvm.K2JVMCompiler.doExecute(K2JVMCompiler.kt:55)
	at org.jetbrains.kotlin.cli.common.CLICompiler.execImpl(CLICompiler.kt:84)

	at android.databinding.tool.util.L.printMessage(L.java:134)
	at android.databinding.tool.util.L.e(L.java:119)
	at android.databinding.tool.reflection.SdkUtil$ApiChecker.<init>(SdkUtil.java:126)
	at android.databinding.tool.reflection.SdkUtil.create(SdkUtil.java:56)
	at android.databinding.tool.Context.init(Context.kt:50)
	at android.databinding.annotationprocessor.ProcessDataBinding.doProcess(ProcessDataBinding.java:110)
	at android.databinding.annotationprocessor.ProcessDataBinding.process(ProcessDataBinding.java:88)
	at org.jetbrains.kotlin.kapt3.base.incremental.IncrementalProcessor.process(incrementalProcessors.kt)
	at org.jetbrains.kotlin.kapt3.base.ProcessorWrapper.process(annotationProcessing.kt:147)
	at com.sun.tools.javac.processing.JavacProcessingEnvironment.callProcessor(JavacProcessingEnvironment.java:802)
	at com.sun.tools.javac.processing.JavacProcessingEnvironment.access$200(JavacProcessingEnvironment.java:91)
	at com.sun.tools.javac.processing.JavacProcessingEnvironment$DiscoveredProcessors$ProcessorStateIterator.runContributingProcs(JavacProcessingEnvironment.java:635)
	at com.sun.tools.javac.processing.JavacProcessingEnvironment$Round.run(JavacProcessingEnvironment.java:1041)
	at com.sun.tools.javac.processing.JavacProcessingEnvironment.doProcessing(JavacProcessingEnvironment.java:1206)
	at com.sun.tools.javac.main.JavaCompiler.processAnnotations(JavaCompiler.java:1170)
	at com.sun.tools.javac.main.JavaCompiler.processAnnotations(JavaCompiler.java:1068)
	at org.jetbrains.kotlin.kapt3.base.AnnotationProcessingKt.doAnnotationProcessing(annotationProcessing.kt:79)
	at org.jetbrains.kotlin.kapt3.base.AnnotationProcessingKt.doAnnotationProcessing$default(annotationProcessing.kt:35)
	at org.jetbrains.kotlin.kapt3.AbstractKapt3Extension.runAnnotationProcessing(Kapt3Extension.kt:224)
	at org.jetbrains.kotlin.kapt3.AbstractKapt3Extension.analysisCompleted(Kapt3Extension.kt:187)
	at org.jetbrains.kotlin.kapt3.ClasspathBasedKapt3Extension.analysisCompleted(Kapt3Extension.kt:98)
	at org.jetbrains.kotlin.cli.jvm.compiler.TopDownAnalyzerFacadeForJVM$analyzeFilesWithJavaIntegration$2.invoke(TopDownAnalyzerFacadeForJVM.kt:97)
	at org.jetbrains.kotlin.cli.jvm.compiler.TopDownAnalyzerFacadeForJVM.analyzeFilesWithJavaIntegration(TopDownAnalyzerFacadeForJVM.kt:107)
	at org.jetbrains.kotlin.cli.jvm.compiler.TopDownAnalyzerFacadeForJVM.analyzeFilesWithJavaIntegration$default(TopDownAnalyzerFacadeForJVM.kt:82)
	at org.jetbrains.kotlin.cli.jvm.compiler.KotlinToJVMBytecodeCompiler$analyze$1.invoke(KotlinToJVMBytecodeCompiler.kt:557)
	at org.jetbrains.kotlin.cli.jvm.compiler.KotlinToJVMBytecodeCompiler$analyze$1.invoke(KotlinToJVMBytecodeCompiler.kt:82)
	at org.jetbrains.kotlin.cli.common.messages.AnalyzerWithCompilerReport.analyzeAndReport(AnalyzerWithCompilerReport.kt:107)
	at org.jetbrains.kotlin.cli.jvm.compiler.KotlinToJVMBytecodeCompiler.analyze(KotlinToJVMBytecodeCompiler.kt:548)
	at org.jetbrains.kotlin.cli.jvm.compiler.KotlinToJVMBytecodeCompiler.compileModules$cli(KotlinToJVMBytecodeCompiler.kt:177)
	at org.jetbrains.kotlin.cli.jvm.K2JVMCompiler.doExecute(K2JVMCompiler.kt:165)
	at org.jetbrains.kotlin.cli.jvm.K2JVMCompiler.doExecute(K2JVMCompiler.kt:55)
	at org.jetbrains.kotlin.cli.common.CLICompiler.execImpl(CLICompiler.kt:84)
	at org.jetbrains.kotlin.cli.common.CLICompiler.execImpl(CLICompiler.kt:42)
	at org.jetbrains.kotlin.cli.common.CLITool.exec(CLITool.kt:104)
	at org.jetbrains.kotlin.daemon.CompileServiceImpl.compile(CompileServiceImpl.kt:1558)
	at sun.reflect.NativeMethodAccessorImpl.invoke0(Native Method)
	at sun.reflect.NativeMethodAccessorImpl.invoke(NativeMethodAccessorImpl.java:62)
	at sun.reflect.DelegatingMethodAccessorImpl.invoke(DelegatingMethodAccessorImpl.java:43)
	at java.lang.reflect.Method.invoke(Method.java:498)
	at sun.rmi.server.UnicastServerRef.dispatch(UnicastServerRef.java:357)
	at sun.rmi.transport.Transport$1.run(Transport.java:200)
	at sun.rmi.transport.Transport$1.run(Transport.java:197)
	at java.security.AccessController.doPrivileged(Native Method)
	at sun.rmi.transport.Transport.serviceCall(Transport.java:196)
	at sun.rmi.transport.tcp.TCPTransport.handleMessages(TCPTransport.java:573)
	at sun.rmi.transport.tcp.TCPTransport$ConnectionHandler.run0(TCPTransport.java:834)
	at sun.rmi.transport.tcp.TCPTransport$ConnectionHandler.lambda$run$0(TCPTransport.java:688)
	at java.security.AccessController.doPrivileged(Native Method)
	at sun.rmi.transport.tcp.TCPTransport$ConnectionHandler.run(TCPTransport.java:687)
	at java.util.concurrent.ThreadPoolExecutor.runWorker(ThreadPoolExecutor.java:1149)
	at java.util.concurrent.ThreadPoolExecutor$Worker.run(ThreadPoolExecutor.java:624)
	at java.lang.Thread.run(Thread.java:748)


> Task :kaptGenericReleaseKotlin FAILED

FAILURE: Build failed with an exception.

* What went wrong:
Execution failed for task ':kaptGenericReleaseKotlin'.
> Compilation error. See log for more details

* Try:
Run with --stacktrace option to get the stack trace. Run with --info or --debug option to get more log output. Run with --scan to get full insights.

* Get more help at https://help.gradle.org

Deprecated Gradle features were used in this build, making it incompatible with Gradle 6.0.
Use '--warning-mode all' to show the individual deprecation warnings.
See https://docs.gradle.org/5.4.1/userguide/command_line_interface.html#sec:command_line_warnings

BUILD FAILED in 8m 43s
18 actionable tasks: 18 executed
==== detail end ====