com.osfans.trime/lastbuild 20211002

From F-Droid
Jump to: navigation, search

Installed Android Tools

Build Log

'Build.py failed on server for com.osfans.trime:3.2.3'

detail

[...]
er.android.com/r/studio-ui/ndk-dir
[CXX5106] NDK was located by using ndk.dir property. This method is deprecated and will be removed in a future release. Please delete ndk.dir from local.properties and set android.ndkVersion to [23.0.7599858] in all native modules in the project. https://developer.android.com/r/studio-ui/ndk-dir
WARNING:[CXX5106] NDK was located by using ndk.dir property. This method is deprecated and will be removed in a future release. Please delete ndk.dir from local.properties and set android.ndkVersion to [23.0.7599858] in all native modules in the project. https://developer.android.com/r/studio-ui/ndk-dir
[CXX5106] NDK was located by using ndk.dir property. This method is deprecated and will be removed in a future release. Please delete ndk.dir from local.properties and set android.ndkVersion to [23.0.7599858] in all native modules in the project. https://developer.android.com/r/studio-ui/ndk-dir
WARNING:[CXX5106] NDK was located by using ndk.dir property. This method is deprecated and will be removed in a future release. Please delete ndk.dir from local.properties and set android.ndkVersion to [23.0.7599858] in all native modules in the project. https://developer.android.com/r/studio-ui/ndk-dir
[CXX5106] NDK was located by using ndk.dir property. This method is deprecated and will be removed in a future release. Please delete ndk.dir from local.properties and set android.ndkVersion to [23.0.7599858] in all native modules in the project. https://developer.android.com/r/studio-ui/ndk-dir
WARNING:[CXX5106] NDK was located by using ndk.dir property. This method is deprecated and will be removed in a future release. Please delete ndk.dir from local.properties and set android.ndkVersion to [23.0.7599858] in all native modules in the project. https://developer.android.com/r/studio-ui/ndk-dir
[CXX5106] NDK was located by using ndk.dir property. This method is deprecated and will be removed in a future release. Please delete ndk.dir from local.properties and set android.ndkVersion to [23.0.7599858] in all native modules in the project. https://developer.android.com/r/studio-ui/ndk-dir
WARNING:[CXX5106] NDK was located by using ndk.dir property. This method is deprecated and will be removed in a future release. Please delete ndk.dir from local.properties and set android.ndkVersion to [23.0.7599858] in all native modules in the project. https://developer.android.com/r/studio-ui/ndk-dir
[CXX5106] NDK was located by using ndk.dir property. This method is deprecated and will be removed in a future release. Please delete ndk.dir from local.properties and set android.ndkVersion to [23.0.7599858] in all native modules in the project. https://developer.android.com/r/studio-ui/ndk-dir
Checking the license for package Android SDK Build-Tools 30.0.2 in /opt/android-sdk/licenses
License for package Android SDK Build-Tools 30.0.2 accepted.
Preparing "Install Android SDK Build-Tools 30.0.2 (revision: 30.0.2)".
"Install Android SDK Build-Tools 30.0.2 (revision: 30.0.2)" ready.
Installing Android SDK Build-Tools 30.0.2 in /opt/android-sdk/build-tools/30.0.2
"Install Android SDK Build-Tools 30.0.2 (revision: 30.0.2)" complete.
"Install Android SDK Build-Tools 30.0.2 (revision: 30.0.2)" finished.
Checking the license for package Android SDK Platform 30 in /opt/android-sdk/licenses
License for package Android SDK Platform 30 accepted.
Preparing "Install Android SDK Platform 30 (revision: 3)".
"Install Android SDK Platform 30 (revision: 3)" ready.
Installing Android SDK Platform 30 in /opt/android-sdk/platforms/android-30
"Install Android SDK Platform 30 (revision: 3)" complete.
"Install Android SDK Platform 30 (revision: 3)" finished.

> Task :app:preBuild UP-TO-DATE
> Task :app:preReleaseBuild UP-TO-DATE
> Task :app:compileReleaseAidl NO-SOURCE
> Task :app:compileReleaseRenderscript NO-SOURCE
> Task :app:dataBindingMergeDependencyArtifactsRelease
> Task :app:dataBindingMergeGenClassesRelease
> Task :app:generateReleaseResValues
> Task :app:generateReleaseResources
> Task :app:generateReleaseBuildConfig
> Task :app:checkReleaseAarMetadata
> Task :app:createReleaseCompatibleScreenManifests
> Task :app:extractDeepLinksRelease
> Task :app:mergeReleaseResources
> Task :app:processReleaseMainManifest
> Task :app:dataBindingGenBaseClassesRelease
> Task :app:processReleaseManifest
> Task :app:javaPreCompileRelease

> Task :app:configureCMakeRelWithDebInfo FAILED
C/C++: release|armeabi-v7a :CMake Warning at /opt/android-sdk/ndk/23.0.7599858/build/cmake/android-legacy.toolchain.cmake:416 (message):
C/C++: release|armeabi-v7a :  An old version of CMake is being used that cannot automatically detect
C/C++: release|armeabi-v7a :  compiler attributes.  Compiler identification is being bypassed.  Some
C/C++: release|armeabi-v7a :  values may be wrong or missing.  Update to CMake 3.19 or newer to use
C/C++: release|armeabi-v7a :  CMake's built-in compiler identification.
C/C++: release|armeabi-v7a :Call Stack (most recent call first):
C/C++: release|armeabi-v7a :  /opt/android-sdk/ndk/23.0.7599858/build/cmake/android.toolchain.cmake:55 (include)
C/C++: release|armeabi-v7a :  /opt/android-sdk/cmake/3.18.1/share/cmake-3.18/Modules/CMakeDetermineSystem.cmake:93 (include)
C/C++: release|armeabi-v7a :  CMakeLists.txt:1 (project)
C/C++: release|armeabi-v7a :CMake Warning at /opt/android-sdk/ndk/23.0.7599858/build/cmake/android-legacy.toolchain.cmake:416 (message):
C/C++: release|armeabi-v7a :  An old version of CMake is being used that cannot automatically detect
C/C++: release|armeabi-v7a :  compiler attributes.  Compiler identification is being bypassed.  Some
C/C++: release|armeabi-v7a :  values may be wrong or missing.  Update to CMake 3.19 or newer to use
C/C++: release|armeabi-v7a :  CMake's built-in compiler identification.
C/C++: release|armeabi-v7a :Call Stack (most recent call first):
C/C++: release|armeabi-v7a :  /opt/android-sdk/ndk/23.0.7599858/build/cmake/android.toolchain.cmake:55 (include)
C/C++: release|armeabi-v7a :  /home/vagrant/build/com.osfans.trime/app/.cxx/RelWithDebInfo/313jy441/armeabi-v7a/CMakeFiles/3.18.1-g262b901/CMakeSystem.cmake:6 (include)
C/C++: release|armeabi-v7a :  /home/vagrant/build/com.osfans.trime/app/.cxx/RelWithDebInfo/313jy441/armeabi-v7a/CMakeFiles/CMakeTmp/CMakeLists.txt:2 (project)
C/C++: release|armeabi-v7a :CMake Warning at /opt/android-sdk/ndk/23.0.7599858/build/cmake/android-legacy.toolchain.cmake:416 (message):
C/C++: release|armeabi-v7a :  An old version of CMake is being used that cannot automatically detect
C/C++: release|armeabi-v7a :  compiler attributes.  Compiler identification is being bypassed.  Some
C/C++: release|armeabi-v7a :  values may be wrong or missing.  Update to CMake 3.19 or newer to use
C/C++: release|armeabi-v7a :  CMake's built-in compiler identification.
C/C++: release|armeabi-v7a :Call Stack (most recent call first):
C/C++: release|armeabi-v7a :  /opt/android-sdk/ndk/23.0.7599858/build/cmake/android.toolchain.cmake:55 (include)
C/C++: release|armeabi-v7a :  /home/vagrant/build/com.osfans.trime/app/.cxx/RelWithDebInfo/313jy441/armeabi-v7a/CMakeFiles/3.18.1-g262b901/CMakeSystem.cmake:6 (include)
C/C++: release|armeabi-v7a :  /home/vagrant/build/com.osfans.trime/app/.cxx/RelWithDebInfo/313jy441/armeabi-v7a/CMakeFiles/CMakeTmp/CMakeLists.txt:2 (project)
C/C++: release|armeabi-v7a :CMake Error at /opt/android-sdk/cmake/3.18.1/share/cmake-3.18/Modules/CMakeTestCCompiler.cmake:66 (message):
C/C++: release|armeabi-v7a :  The C compiler
C/C++: release|armeabi-v7a :    "/opt/android-sdk/ndk/23.0.7599858/toolchains/llvm/prebuilt/linux-x86_64/bin/clang"
C/C++: release|armeabi-v7a :  is not able to compile a simple test program.
C/C++: release|armeabi-v7a :  It fails with the following output:
C/C++: release|armeabi-v7a :    Change Dir: /home/vagrant/build/com.osfans.trime/app/.cxx/RelWithDebInfo/313jy441/armeabi-v7a/CMakeFiles/CMakeTmp
C/C++: release|armeabi-v7a :    
C/C++: release|armeabi-v7a :    Run Build Command(s):/opt/android-sdk/cmake/3.18.1/bin/ninja cmTC_88725 && [1/2] Building C object CMakeFiles/cmTC_88725.dir/testCCompiler.c.o
C/C++: release|armeabi-v7a :    FAILED: CMakeFiles/cmTC_88725.dir/testCCompiler.c.o 
C/C++: release|armeabi-v7a :    /opt/android-sdk/ndk/23.0.7599858/toolchains/llvm/prebuilt/linux-x86_64/bin/clang --target=armv7-none-linux-androideabi16 --gcc-toolchain=/opt/android-sdk/ndk/23.0.7599858/toolchains/llvm/prebuilt/linux-x86_64 --sysroot=/opt/android-sdk/ndk/23.0.7599858/toolchains/llvm/prebuilt/linux-x86_64/sysroot   -g -DANDROID -fdata-sections -ffunction-sections -funwind-tables -fstack-protector-strong -no-canonical-prefixes -D_FORTIFY_SOURCE=2 -march=armv7-a -mthumb -Wformat -Werror=format-security   -fPIE -MD -MT CMakeFiles/cmTC_88725.dir/testCCompiler.c.o -MF CMakeFiles/cmTC_88725.dir/testCCompiler.c.o.d -o CMakeFiles/cmTC_88725.dir/testCCompiler.c.o -c testCCompiler.c
C/C++: release|armeabi-v7a :    /opt/android-sdk/ndk/23.0.7599858/toolchains/llvm/prebuilt/linux-x86_64/bin/clang: 1: /opt/android-sdk/ndk/23.0.7599858/toolchains/llvm/prebuilt/linux-x86_64/bin/clang: clang-12: not found
C/C++: release|armeabi-v7a :    ninja: build stopped: subcommand failed.
C/C++: release|armeabi-v7a :    
C/C++: release|armeabi-v7a :    
C/C++: release|armeabi-v7a :  
C/C++: release|armeabi-v7a :  CMake will not be able to correctly generate this project.
C/C++: release|armeabi-v7a :Call Stack (most recent call first):
C/C++: release|armeabi-v7a :  CMakeLists.txt:1 (project)

> Task :app:processReleaseManifestForPackage

FAILURE: Build failed with an exception.

* What went wrong:
Execution failed for task ':app:configureCMakeRelWithDebInfo'.
> [CXX1405] error when building with cmake using /home/vagrant/build/com.osfans.trime/app/src/main/jni/CMakeLists.txt: Build command failed.
  Error while executing process /opt/android-sdk/cmake/3.18.1/bin/cmake with arguments {-H/home/vagrant/build/com.osfans.trime/app/src/main/jni -DCMAKE_SYSTEM_NAME=Android -DCMAKE_EXPORT_COMPILE_COMMANDS=ON -DCMAKE_SYSTEM_VERSION=16 -DANDROID_PLATFORM=android-16 -DANDROID_ABI=armeabi-v7a -DCMAKE_ANDROID_ARCH_ABI=armeabi-v7a -DANDROID_NDK=/opt/android-sdk/ndk/23.0.7599858 -DCMAKE_ANDROID_NDK=/opt/android-sdk/ndk/23.0.7599858 -DCMAKE_TOOLCHAIN_FILE=/opt/android-sdk/ndk/23.0.7599858/build/cmake/android.toolchain.cmake -DCMAKE_MAKE_PROGRAM=/opt/android-sdk/cmake/3.18.1/bin/ninja -DCMAKE_LIBRARY_OUTPUT_DIRECTORY=/home/vagrant/build/com.osfans.trime/app/build/intermediates/cxx/RelWithDebInfo/313jy441/obj/armeabi-v7a -DCMAKE_RUNTIME_OUTPUT_DIRECTORY=/home/vagrant/build/com.osfans.trime/app/build/intermediates/cxx/RelWithDebInfo/313jy441/obj/armeabi-v7a -DCMAKE_BUILD_TYPE=RelWithDebInfo -B/home/vagrant/build/com.osfans.trime/app/.cxx/RelWithDebInfo/313jy441/armeabi-v7a -GNinja -DANDROID_TOOLCHAIN=clang -DANDROID_STL=c++_static -DANDROID_STL_FORCE_FEATURES=ON}
  -- Detecting C compiler ABI info
  -- Detecting C compiler ABI info - failed
  -- Check for working C compiler: /opt/android-sdk/ndk/23.0.7599858/toolchains/llvm/prebuilt/linux-x86_64/bin/clang
  -- Check for working C compiler: /opt/android-sdk/ndk/23.0.7599858/toolchains/llvm/prebuilt/linux-x86_64/bin/clang - broken
  -- Configuring incomplete, errors occurred!
  See also "/home/vagrant/build/com.osfans.trime/app/.cxx/RelWithDebInfo/313jy441/armeabi-v7a/CMakeFiles/CMakeOutput.log".
  See also "/home/vagrant/build/com.osfans.trime/app/.cxx/RelWithDebInfo/313jy441/armeabi-v7a/CMakeFiles/CMakeError.log".
  
  CMake Warning at /opt/android-sdk/ndk/23.0.7599858/build/cmake/android-legacy.toolchain.cmake:416 (message):
    An old version of CMake is being used that cannot automatically detect
    compiler attributes.  Compiler identification is being bypassed.  Some
    values may be wrong or missing.  Update to CMake 3.19 or newer to use
    CMake's built-in compiler identification.
  Call Stack (most recent call first):
    /opt/android-sdk/ndk/23.0.7599858/build/cmake/android.toolchain.cmake:55 (include)
    /opt/android-sdk/cmake/3.18.1/share/cmake-3.18/Modules/CMakeDetermineSystem.cmake:93 (include)
    CMakeLists.txt:1 (project)
  
  
  CMake Warning at /opt/android-sdk/ndk/23.0.7599858/build/cmake/android-legacy.toolchain.cmake:416 (message):
    An old version of CMake is being used that cannot automatically detect
    compiler attributes.  Compiler identification is being bypassed.  Some
    values may be wrong or missing.  Update to CMake 3.19 or newer to use
    CMake's built-in compiler identification.
  Call Stack (most recent call first):
    /opt/android-sdk/ndk/23.0.7599858/build/cmake/android.toolchain.cmake:55 (include)
    /home/vagrant/build/com.osfans.trime/app/.cxx/RelWithDebInfo/313jy441/armeabi-v7a/CMakeFiles/3.18.1-g262b901/CMakeSystem.cmake:6 (include)
    /home/vagrant/build/com.osfans.trime/app/.cxx/RelWithDebInfo/313jy441/armeabi-v7a/CMakeFiles/CMakeTmp/CMakeLists.txt:2 (project)
  
  
  CMake Warning at /opt/android-sdk/ndk/23.0.7599858/build/cmake/android-legacy.toolchain.cmake:416 (message):
    An old version of CMake is being used that cannot automatically detect
    compiler attributes.  Compiler identification is being bypassed.  Some
    values may be wrong or missing.  Update to CMake 3.19 or newer to use
    CMake's built-in compiler identification.
  Call Stack (most recent call first):
    /opt/android-sdk/ndk/23.0.7599858/build/cmake/android.toolchain.cmake:55 (include)
    /home/vagrant/build/com.osfans.trime/app/.cxx/RelWithDebInfo/313jy441/armeabi-v7a/CMakeFiles/3.18.1-g262b901/CMakeSystem.cmake:6 (include)
    /home/vagrant/build/com.osfans.trime/app/.cxx/RelWithDebInfo/313jy441/armeabi-v7a/CMakeFiles/CMakeTmp/CMakeLists.txt:2 (project)
  
  
  CMake Error at /opt/android-sdk/cmake/3.18.1/share/cmake-3.18/Modules/CMakeTestCCompiler.cmake:66 (message):
    The C compiler
  
      "/opt/android-sdk/ndk/23.0.7599858/toolchains/llvm/prebuilt/linux-x86_64/bin/clang"
  
    is not able to compile a simple test program.
  
    It fails with the following output:
  
      Change Dir: /home/vagrant/build/com.osfans.trime/app/.cxx/RelWithDebInfo/313jy441/armeabi-v7a/CMakeFiles/CMakeTmp
      
      Run Build Command(s):/opt/android-sdk/cmake/3.18.1/bin/ninja cmTC_88725 && [1/2] Building C object CMakeFiles/cmTC_88725.dir/testCCompiler.c.o
      FAILED: CMakeFiles/cmTC_88725.dir/testCCompiler.c.o 
      /opt/android-sdk/ndk/23.0.7599858/toolchains/llvm/prebuilt/linux-x86_64/bin/clang --target=armv7-none-linux-androideabi16 --gcc-toolchain=/opt/android-sdk/ndk/23.0.7599858/toolchains/llvm/prebuilt/linux-x86_64 --sysroot=/opt/android-sdk/ndk/23.0.7599858/toolchains/llvm/prebuilt/linux-x86_64/sysroot   -g -DANDROID -fdata-sections -ffunction-sections -funwind-tables -fstack-protector-strong -no-canonical-prefixes -D_FORTIFY_SOURCE=2 -march=armv7-a -mthumb -Wformat -Werror=format-security   -fPIE -MD -MT CMakeFiles/cmTC_88725.dir/testCCompiler.c.o -MF CMakeFiles/cmTC_88725.dir/testCCompiler.c.o.d -o CMakeFiles/cmTC_88725.dir/testCCompiler.c.o -c testCCompiler.c
      /opt/android-sdk/ndk/23.0.7599858/toolchains/llvm/prebuilt/linux-x86_64/bin/clang: 1: /opt/android-sdk/ndk/23.0.7599858/toolchains/llvm/prebuilt/linux-x86_64/bin/clang: clang-12: not found
      ninja: build stopped: subcommand failed.
      
      
  
    
  
    CMake will not be able to correctly generate this project.
  Call Stack (most recent call first):
    CMakeLists.txt:1 (project)
  
  


* Try:
Run with --stacktrace option to get the stack trace. Run with --info or --debug option to get more log output. Run with --scan to get full insights.

* Get more help at https://help.gradle.org

BUILD FAILED in 24s
14 actionable tasks: 14 executed
==== detail end ====
2021-11-23 06:15:57,172 DEBUG: Error encoutered, stopping by user request.