com.tutpro.baresip.plus/lastbuild 24

From F-Droid
Jump to: navigation, search

Installed Android Tools

Build Log

'Build.py failed on server for com.tutpro.baresip.plus:10.0.0'

detail

[...]
> Task :app:compileReleaseRenderscript NO-SOURCE
> Task :app:dataBindingMergeDependencyArtifactsRelease
> Task :app:dataBindingMergeGenClassesRelease
> Task :app:generateReleaseResValues
> Task :app:generateReleaseResources
> Task :app:generateReleaseBuildConfig
> Task :app:mergeReleaseResources
> Task :app:dataBindingGenBaseClassesRelease
> Task :app:createReleaseCompatibleScreenManifests
> Task :app:extractDeepLinksRelease
> Task :app:processReleaseMainManifest
> Task :app:checkReleaseAarMetadata
> Task :app:processReleaseManifest
> Task :app:processReleaseManifestForPackage
> Task :app:javaPreCompileRelease
> Task :app:processReleaseResources

> Task :app:compileReleaseKotlin
w: /home/vagrant/build/com.tutpro.baresip.plus/app/src/main/kotlin/com/tutpro/baresip/plus/BaresipService.kt: (69, 37): 'getExternalStoragePublicDirectory(String!): File!' is deprecated. Deprecated in Java
w: /home/vagrant/build/com.tutpro.baresip.plus/app/src/main/kotlin/com/tutpro/baresip/plus/BaresipService.kt: (573, 66): 'PRIORITY_HIGH: Int' is deprecated. Deprecated in Java
w: /home/vagrant/build/com.tutpro.baresip.plus/app/src/main/kotlin/com/tutpro/baresip/plus/BaresipService.kt: (695, 66): 'PRIORITY_HIGH: Int' is deprecated. Deprecated in Java
w: /home/vagrant/build/com.tutpro.baresip.plus/app/src/main/kotlin/com/tutpro/baresip/plus/BaresipService.kt: (764, 66): 'PRIORITY_HIGH: Int' is deprecated. Deprecated in Java
w: /home/vagrant/build/com.tutpro.baresip.plus/app/src/main/kotlin/com/tutpro/baresip/plus/BaresipService.kt: (831, 51): 'PRIORITY_HIGH: Int' is deprecated. Deprecated in Java
w: /home/vagrant/build/com.tutpro.baresip.plus/app/src/main/kotlin/com/tutpro/baresip/plus/BaresipService.kt: (1019, 20): 'requestAudioFocus(AudioManager.OnAudioFocusChangeListener!, Int, Int): Int' is deprecated. Deprecated in Java
w: /home/vagrant/build/com.tutpro.baresip.plus/app/src/main/kotlin/com/tutpro/baresip/plus/BaresipService.kt: (1056, 24): 'abandonAudioFocus(AudioManager.OnAudioFocusChangeListener!): Int' is deprecated. Deprecated in Java
w: /home/vagrant/build/com.tutpro.baresip.plus/app/src/main/kotlin/com/tutpro/baresip/plus/Utils.kt: (631, 19): Parameter 'ctx' is never used

> Task :app:compileReleaseJavaWithJavac
> Task :app:generateJsonModelRelease

> Task :app:externalNativeBuildRelease FAILED
Build baresip_armeabi-v7a
ninja: Entering directory `/home/vagrant/build/com.tutpro.baresip.plus/app/.cxx/cmake/release/armeabi-v7a'
[1/3] Building C object CMakeFiles/baresip.dir/vidisp.c.o
[2/3] Building C object CMakeFiles/baresip.dir/baresip.c.o
/home/vagrant/build/com.tutpro.baresip.plus/app/src/main/cpp/baresip.c:87:82: warning: implicit declaration of function 'uag_current' is invalid in C99 [-Wimplicit-function-declaration]
    l = re_snprintf(&(debug_buf[0]), 2047, "%H", video_debug, call_video(ua_call(uag_current())));
                                                                                 ^
/home/vagrant/build/com.tutpro.baresip.plus/app/src/main/cpp/baresip.c:87:82: warning: incompatible integer to pointer conversion passing 'int' to parameter of type 'const struct ua *' [-Wint-conversion]
    l = re_snprintf(&(debug_buf[0]), 2047, "%H", video_debug, call_video(ua_call(uag_current())));
                                                                                 ^~~~~~~~~~~~~
/home/vagrant/build/com.tutpro.baresip.plus/app/src/main/cpp/../../../../distribution.video/baresip/include/baresip.h:797:42: note: passing argument to parameter 'ua' here
struct call    *ua_call(const struct ua *ua);
                                         ^
/home/vagrant/build/com.tutpro.baresip.plus/app/src/main/cpp/baresip.c:1250:5: warning: implicit declaration of function 'uag_current_set' is invalid in C99 [-Wimplicit-function-declaration]
    uag_current_set(ua);
    ^
3 warnings generated.
[3/3] Linking C shared library /home/vagrant/build/com.tutpro.baresip.plus/app/build/intermediates/cmake/release/obj/armeabi-v7a/libbaresip.so
FAILED: /home/vagrant/build/com.tutpro.baresip.plus/app/build/intermediates/cmake/release/obj/armeabi-v7a/libbaresip.so 
: && /home/vagrant/android-ndk/r21d/toolchains/llvm/prebuilt/linux-x86_64/bin/clang --target=armv7-none-linux-androideabi24 --gcc-toolchain=/home/vagrant/android-ndk/r21d/toolchains/llvm/prebuilt/linux-x86_64 --sysroot=/home/vagrant/android-ndk/r21d/toolchains/llvm/prebuilt/linux-x86_64/sysroot -fPIC -g -DANDROID -fdata-sections -ffunction-sections -funwind-tables -fstack-protector-strong -no-canonical-prefixes -D_FORTIFY_SOURCE=2 -march=armv7-a -mthumb -Wformat -Werror=format-security -DHAVE_INTTYPES_H -Oz -DNDEBUG  -Wl,--exclude-libs,libgcc.a -Wl,--exclude-libs,libgcc_real.a -Wl,--exclude-libs,libatomic.a -static-libstdc++ -Wl,--build-id -Wl,--fatal-warnings -Wl,--exclude-libs,libunwind.a -Wl,--no-undefined -Qunused-arguments -shared -Wl,-soname,libbaresip.so -o /home/vagrant/build/com.tutpro.baresip.plus/app/build/intermediates/cmake/release/obj/armeabi-v7a/libbaresip.so CMakeFiles/baresip.dir/baresip.c.o CMakeFiles/baresip.dir/vidisp.c.o  -landroid -lEGL -lGLESv2 -lGLESv1_CM -lOpenSLES /home/vagrant/build/com.tutpro.baresip.plus/app/src/main/cpp/../../../../distribution.video/baresip/lib/armeabi-v7a/libbaresip.a /home/vagrant/build/com.tutpro.baresip.plus/app/src/main/cpp/../../../../distribution.video/rem/lib/armeabi-v7a/librem.a /home/vagrant/build/com.tutpro.baresip.plus/app/src/main/cpp/../../../../distribution.video/re/lib/armeabi-v7a/libre.a /home/vagrant/build/com.tutpro.baresip.plus/app/src/main/cpp/../../../../distribution.video/openssl/lib/armeabi-v7a/libssl.a /home/vagrant/build/com.tutpro.baresip.plus/app/src/main/cpp/../../../../distribution.video/openssl/lib/armeabi-v7a/libcrypto.a /home/vagrant/build/com.tutpro.baresip.plus/app/src/main/cpp/../../../../distribution.video/opus/lib/armeabi-v7a/libopus.a /home/vagrant/build/com.tutpro.baresip.plus/app/src/main/cpp/../../../../distribution.video/ffmpeg/lib/armeabi-v7a/libavdevice.a /home/vagrant/build/com.tutpro.baresip.plus/app/src/main/cpp/../../../../distribution.video/ffmpeg/lib/armeabi-v7a/libavfilter.a /home/vagrant/build/com.tutpro.baresip.plus/app/src/main/cpp/../../../../distribution.video/ffmpeg/lib/armeabi-v7a/libswscale.a /home/vagrant/build/com.tutpro.baresip.plus/app/src/main/cpp/../../../../distribution.video/ffmpeg/lib/armeabi-v7a/libavformat.a /home/vagrant/build/com.tutpro.baresip.plus/app/src/main/cpp/../../../../distribution.video/ffmpeg/lib/armeabi-v7a/libavcodec.a /home/vagrant/build/com.tutpro.baresip.plus/app/src/main/cpp/../../../../distribution.video/x264/lib/armeabi-v7a/libx264.a /home/vagrant/build/com.tutpro.baresip.plus/app/src/main/cpp/../../../../distribution.video/vpx/lib/armeabi-v7a/libvpx.a /home/vagrant/build/com.tutpro.baresip.plus/app/src/main/cpp/../../../../distribution.video/ffmpeg/lib/armeabi-v7a/libavutil.a /home/vagrant/build/com.tutpro.baresip.plus/app/src/main/cpp/../../../../distribution.video/ffmpeg/lib/armeabi-v7a/libswresample.a /home/vagrant/build/com.tutpro.baresip.plus/app/src/main/cpp/../../../../distribution.video/ffmpeg/lib/armeabi-v7a/libpostproc.a /home/vagrant/build/com.tutpro.baresip.plus/app/src/main/cpp/../../../../distribution.video/spandsp/lib/armeabi-v7a/libspandsp.a /home/vagrant/build/com.tutpro.baresip.plus/app/src/main/cpp/../../../../distribution.video/g7221/lib/armeabi-v7a/libg722_1.a /home/vagrant/build/com.tutpro.baresip.plus/app/src/main/cpp/../../../../distribution.video/g729/lib/armeabi-v7a/libbcg729.a /home/vagrant/build/com.tutpro.baresip.plus/app/src/main/cpp/../../../../distribution.video/ilbc/lib/armeabi-v7a/libilbc.a /home/vagrant/build/com.tutpro.baresip.plus/app/src/main/cpp/../../../../distribution.video/amr/lib/armeabi-v7a/libamrnb.a /home/vagrant/build/com.tutpro.baresip.plus/app/src/main/cpp/../../../../distribution.video/amr/lib/armeabi-v7a/libamrwb.a /home/vagrant/build/com.tutpro.baresip.plus/app/src/main/cpp/../../../../distribution.video/amr/lib/armeabi-v7a/libamrwbenc.a /home/vagrant/build/com.tutpro.baresip.plus/app/src/main/cpp/../../../../distribution.video/webrtc/lib/armeabi-v7a/libwebrtc.a /home/vagrant/build/com.tutpro.baresip.plus/app/src/main/cpp/../../../../distribution.video/zrtp/lib/armeabi-v7a/libzrtp.a /home/vagrant/build/com.tutpro.baresip.plus/app/src/main/cpp/../../../../distribution.video/bn/lib/armeabi-v7a/libbn.a -lz -llog -lcamera2ndk -lmediandk -latomic -lm && :
/home/vagrant/build/com.tutpro.baresip.plus/app/src/main/cpp/baresip.c:1250: error: undefined reference to 'uag_current_set'
/home/vagrant/build/com.tutpro.baresip.plus/app/src/main/cpp/baresip.c:87: error: undefined reference to 'uag_current'
clang: error: linker command failed with exit code 1 (use -v to see invocation)
ninja: build stopped: subcommand failed.

FAILURE: Build failed with an exception.

* What went wrong:
Execution failed for task ':app:externalNativeBuildRelease'.
> Build command failed.
  Error while executing process /home/vagrant/android-sdk/cmake/3.10.2.4988404/bin/ninja with arguments {-C /home/vagrant/build/com.tutpro.baresip.plus/app/.cxx/cmake/release/armeabi-v7a baresip}
  ninja: Entering directory `/home/vagrant/build/com.tutpro.baresip.plus/app/.cxx/cmake/release/armeabi-v7a'
  [1/3] Building C object CMakeFiles/baresip.dir/vidisp.c.o
  [2/3] Building C object CMakeFiles/baresip.dir/baresip.c.o
  /home/vagrant/build/com.tutpro.baresip.plus/app/src/main/cpp/baresip.c:87:82: warning: implicit declaration of function 'uag_current' is invalid in C99 [-Wimplicit-function-declaration]
      l = re_snprintf(&(debug_buf[0]), 2047, "%H", video_debug, call_video(ua_call(uag_current())));
                                                                                   ^
  /home/vagrant/build/com.tutpro.baresip.plus/app/src/main/cpp/baresip.c:87:82: warning: incompatible integer to pointer conversion passing 'int' to parameter of type 'const struct ua *' [-Wint-conversion]
      l = re_snprintf(&(debug_buf[0]), 2047, "%H", video_debug, call_video(ua_call(uag_current())));
                                                                                   ^~~~~~~~~~~~~
  /home/vagrant/build/com.tutpro.baresip.plus/app/src/main/cpp/../../../../distribution.video/baresip/include/baresip.h:797:42: note: passing argument to parameter 'ua' here
  struct call    *ua_call(const struct ua *ua);
                                           ^
  /home/vagrant/build/com.tutpro.baresip.plus/app/src/main/cpp/baresip.c:1250:5: warning: implicit declaration of function 'uag_current_set' is invalid in C99 [-Wimplicit-function-declaration]
      uag_current_set(ua);
      ^
  3 warnings generated.
  [3/3] Linking C shared library /home/vagrant/build/com.tutpro.baresip.plus/app/build/intermediates/cmake/release/obj/armeabi-v7a/libbaresip.so
  FAILED: /home/vagrant/build/com.tutpro.baresip.plus/app/build/intermediates/cmake/release/obj/armeabi-v7a/libbaresip.so 
  : && /home/vagrant/android-ndk/r21d/toolchains/llvm/prebuilt/linux-x86_64/bin/clang --target=armv7-none-linux-androideabi24 --gcc-toolchain=/home/vagrant/android-ndk/r21d/toolchains/llvm/prebuilt/linux-x86_64 --sysroot=/home/vagrant/android-ndk/r21d/toolchains/llvm/prebuilt/linux-x86_64/sysroot -fPIC -g -DANDROID -fdata-sections -ffunction-sections -funwind-tables -fstack-protector-strong -no-canonical-prefixes -D_FORTIFY_SOURCE=2 -march=armv7-a -mthumb -Wformat -Werror=format-security -DHAVE_INTTYPES_H -Oz -DNDEBUG  -Wl,--exclude-libs,libgcc.a -Wl,--exclude-libs,libgcc_real.a -Wl,--exclude-libs,libatomic.a -static-libstdc++ -Wl,--build-id -Wl,--fatal-warnings -Wl,--exclude-libs,libunwind.a -Wl,--no-undefined -Qunused-arguments -shared -Wl,-soname,libbaresip.so -o /home/vagrant/build/com.tutpro.baresip.plus/app/build/intermediates/cmake/release/obj/armeabi-v7a/libbaresip.so CMakeFiles/baresip.dir/baresip.c.o CMakeFiles/baresip.dir/vidisp.c.o  -landroid -lEGL -lGLESv2 -lGLESv1_CM -lOpenSLES /home/vagrant/build/com.tutpro.baresip.plus/app/src/main/cpp/../../../../distribution.video/baresip/lib/armeabi-v7a/libbaresip.a /home/vagrant/build/com.tutpro.baresip.plus/app/src/main/cpp/../../../../distribution.video/rem/lib/armeabi-v7a/librem.a /home/vagrant/build/com.tutpro.baresip.plus/app/src/main/cpp/../../../../distribution.video/re/lib/armeabi-v7a/libre.a /home/vagrant/build/com.tutpro.baresip.plus/app/src/main/cpp/../../../../distribution.video/openssl/lib/armeabi-v7a/libssl.a /home/vagrant/build/com.tutpro.baresip.plus/app/src/main/cpp/../../../../distribution.video/openssl/lib/armeabi-v7a/libcrypto.a /home/vagrant/build/com.tutpro.baresip.plus/app/src/main/cpp/../../../../distribution.video/opus/lib/armeabi-v7a/libopus.a /home/vagrant/build/com.tutpro.baresip.plus/app/src/main/cpp/../../../../distribution.video/ffmpeg/lib/armeabi-v7a/libavdevice.a /home/vagrant/build/com.tutpro.baresip.plus/app/src/main/cpp/../../../../distribution.video/ffmpeg/lib/armeabi-v7a/libavfilter.a /home/vagrant/build/com.tutpro.baresip.plus/app/src/main/cpp/../../../../distribution.video/ffmpeg/lib/armeabi-v7a/libswscale.a /home/vagrant/build/com.tutpro.baresip.plus/app/src/main/cpp/../../../../distribution.video/ffmpeg/lib/armeabi-v7a/libavformat.a /home/vagrant/build/com.tutpro.baresip.plus/app/src/main/cpp/../../../../distribution.video/ffmpeg/lib/armeabi-v7a/libavcodec.a /home/vagrant/build/com.tutpro.baresip.plus/app/src/main/cpp/../../../../distribution.video/x264/lib/armeabi-v7a/libx264.a /home/vagrant/build/com.tutpro.baresip.plus/app/src/main/cpp/../../../../distribution.video/vpx/lib/armeabi-v7a/libvpx.a /home/vagrant/build/com.tutpro.baresip.plus/app/src/main/cpp/../../../../distribution.video/ffmpeg/lib/armeabi-v7a/libavutil.a /home/vagrant/build/com.tutpro.baresip.plus/app/src/main/cpp/../../../../distribution.video/ffmpeg/lib/armeabi-v7a/libswresample.a /home/vagrant/build/com.tutpro.baresip.plus/app/src/main/cpp/../../../../distribution.video/ffmpeg/lib/armeabi-v7a/libpostproc.a /home/vagrant/build/com.tutpro.baresip.plus/app/src/main/cpp/../../../../distribution.video/spandsp/lib/armeabi-v7a/libspandsp.a /home/vagrant/build/com.tutpro.baresip.plus/app/src/main/cpp/../../../../distribution.video/g7221/lib/armeabi-v7a/libg722_1.a /home/vagrant/build/com.tutpro.baresip.plus/app/src/main/cpp/../../../../distribution.video/g729/lib/armeabi-v7a/libbcg729.a /home/vagrant/build/com.tutpro.baresip.plus/app/src/main/cpp/../../../../distribution.video/ilbc/lib/armeabi-v7a/libilbc.a /home/vagrant/build/com.tutpro.baresip.plus/app/src/main/cpp/../../../../distribution.video/amr/lib/armeabi-v7a/libamrnb.a /home/vagrant/build/com.tutpro.baresip.plus/app/src/main/cpp/../../../../distribution.video/amr/lib/armeabi-v7a/libamrwb.a /home/vagrant/build/com.tutpro.baresip.plus/app/src/main/cpp/../../../../distribution.video/amr/lib/armeabi-v7a/libamrwbenc.a /home/vagrant/build/com.tutpro.baresip.plus/app/src/main/cpp/../../../../distribution.video/webrtc/lib/armeabi-v7a/libwebrtc.a /home/vagrant/build/com.tutpro.baresip.plus/app/src/main/cpp/../../../../distribution.video/zrtp/lib/armeabi-v7a/libzrtp.a /home/vagrant/build/com.tutpro.baresip.plus/app/src/main/cpp/../../../../distribution.video/bn/lib/armeabi-v7a/libbn.a -lz -llog -lcamera2ndk -lmediandk -latomic -lm && :
  /home/vagrant/build/com.tutpro.baresip.plus/app/src/main/cpp/baresip.c:1250: error: undefined reference to 'uag_current_set'
  /home/vagrant/build/com.tutpro.baresip.plus/app/src/main/cpp/baresip.c:87: error: undefined reference to 'uag_current'
  clang: error: linker command failed with exit code 1 (use -v to see invocation)
  ninja: build stopped: subcommand failed.
  


* Try:
Run with --stacktrace option to get the stack trace. Run with --info or --debug option to get more log output. Run with --scan to get full insights.

* Get more help at https://help.gradle.org

BUILD FAILED in 51s
18 actionable tasks: 18 executed
==== detail end ====