de.rampro.activitydiary/lastbuild 135

From F-Droid
Jump to: navigation, search

Installed Android Tools

Build Log

'Build.py failed on server for de.rampro.activitydiary:1.4.1'

detail

== Installed Android Tools ==

2021-10-25 21:26:27,888 DEBUG: Reading 'config.yml'
2021-10-25 21:26:27,897 INFO: Using /opt/android-sdk/build-tools/29.0.3/apksigner 
2021-10-25 21:26:27,900 INFO: Creating log directory
2021-10-25 21:26:27,900 INFO: Creating temporary directory
2021-10-25 21:26:27,900 INFO: Creating output directory
2021-10-25 21:26:27,904 DEBUG: Getting git vcs interface for https://github.com/ramack/ActivityDiary
2021-10-25 21:26:27,904 DEBUG: > git --version
git version 2.11.0
2021-10-25 21:26:28,116 INFO: Using git version 2.11.0
2021-10-25 21:26:28,116 DEBUG: Checking 1.4.1
2021-10-25 21:26:28,116 INFO: Building version 1.4.1 (135) of de.rampro.activitydiary
2021-10-25 21:26:28,117 DEBUG: > sudo passwd --lock root
passwd: password expiry information changed.
2021-10-25 21:26:28,324 DEBUG: > sudo SUDO_FORCE_REMOVE=yes dpkg --purge sudo
(Reading database ... 64914 files and directories currently installed.)
Removing sudo (1.8.19p1-2.1+deb9u3) ...
Purging configuration files for sudo (1.8.19p1-2.1+deb9u3) ...
Processing triggers for systemd (232-25+deb9u13) ...
2021-10-25 21:26:31,769 INFO: Getting source for revision 51c3f3174b363e5f479fd72e5590ded4f53642c7
2021-10-25 21:26:31,770 DEBUG: Directory: build/de.rampro.activitydiary
2021-10-25 21:26:31,770 DEBUG: > git rev-parse --show-toplevel
2021-10-25 21:26:31,974 DEBUG: Directory: build/de.rampro.activitydiary
2021-10-25 21:26:31,974 DEBUG: > git submodule foreach --recursive git reset --hard
2021-10-25 21:26:32,079 DEBUG: Directory: build/de.rampro.activitydiary
2021-10-25 21:26:32,080 DEBUG: > git reset --hard
2021-10-25 21:26:32,288 DEBUG: Directory: build/de.rampro.activitydiary
2021-10-25 21:26:32,289 DEBUG: > git submodule foreach --recursive git clean -dffx
2021-10-25 21:26:32,395 DEBUG: Directory: build/de.rampro.activitydiary
2021-10-25 21:26:32,395 DEBUG: > git clean -dffx
2021-10-25 21:26:32,501 DEBUG: Directory: build/de.rampro.activitydiary
2021-10-25 21:26:32,501 DEBUG: > git -c core.askpass=/bin/true -c core.sshCommand=/bin/false -c url.https://.insteadOf=ssh:// -c url.https://u:p@bitbucket.org/.insteadOf=git@bitbucket.org: -c url.https://u:p@bitbucket.org.insteadOf=git://bitbucket.org -c url.https://u:p@bitbucket.org.insteadOf=https://bitbucket.org -c url.https://u:p@github.com/.insteadOf=git@github.com: -c url.https://u:p@github.com.insteadOf=git://github.com -c url.https://u:p@github.com.insteadOf=https://github.com -c url.https://u:p@gitlab.com/.insteadOf=git@gitlab.com: -c url.https://u:p@gitlab.com.insteadOf=git://gitlab.com -c url.https://u:p@gitlab.com.insteadOf=https://gitlab.com fetch origin
2021-10-25 21:26:33,213 DEBUG: Directory: build/de.rampro.activitydiary
2021-10-25 21:26:33,213 DEBUG: > git -c core.askpass=/bin/true -c core.sshCommand=/bin/false -c url.https://.insteadOf=ssh:// -c url.https://u:p@bitbucket.org/.insteadOf=git@bitbucket.org: -c url.https://u:p@bitbucket.org.insteadOf=git://bitbucket.org -c url.https://u:p@bitbucket.org.insteadOf=https://bitbucket.org -c url.https://u:p@github.com/.insteadOf=git@github.com: -c url.https://u:p@github.com.insteadOf=git://github.com -c url.https://u:p@github.com.insteadOf=https://github.com -c url.https://u:p@gitlab.com/.insteadOf=git@gitlab.com: -c url.https://u:p@gitlab.com.insteadOf=git://gitlab.com -c url.https://u:p@gitlab.com.insteadOf=https://gitlab.com fetch --prune --tags --force origin
2021-10-25 21:26:33,526 DEBUG: Directory: build/de.rampro.activitydiary
2021-10-25 21:26:33,527 DEBUG: > git remote set-head origin --auto
2021-10-25 21:26:33,938 DEBUG: Directory: build/de.rampro.activitydiary
2021-10-25 21:26:33,939 DEBUG: > git checkout -f 51c3f3174b363e5f479fd72e5590ded4f53642c7
2021-10-25 21:26:34,146 DEBUG: Directory: build/de.rampro.activitydiary
2021-10-25 21:26:34,147 DEBUG: > git clean -dffx
2021-10-25 21:26:34,252 INFO: Creating local.properties file at build/de.rampro.activitydiary/local.properties
2021-10-25 21:26:34,253 INFO: Creating local.properties file at build/de.rampro.activitydiary/app/local.properties
2021-10-25 21:26:34,253 DEBUG: Removing debuggable flags from build/de.rampro.activitydiary/app
2021-10-25 21:26:34,269 INFO: Cleaning Gradle project...
2021-10-25 21:26:34,269 DEBUG: Directory: build/de.rampro.activitydiary/app
2021-10-25 21:26:34,269 DEBUG: > /home/vagrant/fdroidserver/gradlew-fdroid clean
Found 7.2 via distributionUrl
Downloading missing gradle version 7.2
cachedir /home/vagrant/.cache/fdroidserver
/home/vagrant/.cache/fdroidserver/gradle-7.2-bin.zip: OK
Running /opt/gradle/versions/7.2/bin/gradle clean

Welcome to Gradle 7.2!

Here are the highlights of this release:
 - Toolchain support for Scala
 - More cache hits when Java source files have platform-specific line endings
 - More resilient remote HTTP build cache behavior

For more details see https://docs.gradle.org/7.2/release-notes.html

To honour the JVM settings for this build a single-use Daemon process will be forked. See https://docs.gradle.org/7.2/userguide/gradle_daemon.html#sec:disabling_the_daemon.
Daemon will be stopped at the end of the build 

FAILURE: Build failed with an exception.

* Where:
Build file '/home/vagrant/build/de.rampro.activitydiary/app/build.gradle' line: 21

* What went wrong:
Plugin [id: 'com.github.triplet.play'] was not found in any of the following sources:

- Gradle Core Plugins (plugin is not in 'org.gradle' namespace)
- Plugin Repositories (plugin dependency must include a version number for this source)

* Try:
Run with --stacktrace option to get the stack trace. Run with --info or --debug option to get more log output. Run with --scan to get full insights.

* Get more help at https://help.gradle.org

Deprecated Gradle features were used in this build, making it incompatible with Gradle 8.0.

You can use '--warning-mode all' to show the individual deprecation warnings and determine if they come from your own scripts or plugins.

See https://docs.gradle.org/7.2/userguide/command_line_interface.html#sec:command_line_warnings

BUILD FAILED in 22s
2021-10-25 21:27:00,058 ERROR: Could not build app de.rampro.activitydiary: Error cleaning de.rampro.activitydiary:1.4.1
==== detail begin ====
Found 7.2 via distributionUrl
Downloading missing gradle version 7.2
cachedir /home/vagrant/.cache/fdroidserver
/home/vagrant/.cache/fdroidserver/gradle-7.2-bin.zip: OK
Running /opt/gradle/versions/7.2/bin/gradle clean

Welcome to Gradle 7.2!

Here are the highlights of this release:
 - Toolchain support for Scala
 - More cache hits when Java source files have platform-specific line endings
 - More resilient remote HTTP build cache behavior

For more details see https://docs.gradle.org/7.2/release-notes.html

To honour the JVM settings for this build a single-use Daemon process will be forked. See https://docs.gradle.org/7.2/userguide/gradle_daemon.html#sec:disabling_the_daemon.
Daemon will be stopped at the end of the build 

FAILURE: Build failed with an exception.

* Where:
Build file '/home/vagrant/build/de.rampro.activitydiary/app/build.gradle' line: 21

* What went wrong:
Plugin [id: 'com.github.triplet.play'] was not found in any of the following sources:

- Gradle Core Plugins (plugin is not in 'org.gradle' namespace)
- Plugin Repositories (plugin dependency must include a version number for this source)

* Try:
Run with --stacktrace option to get the stack trace. Run with --info or --debug option to get more log output. Run with --scan to get full insights.

* Get more help at https://help.gradle.org

Deprecated Gradle features were used in this build, making it incompatible with Gradle 8.0.

You can use '--warning-mode all' to show the individual deprecation warnings and determine if they come from your own scripts or plugins.

See https://docs.gradle.org/7.2/userguide/command_line_interface.html#sec:command_line_warnings

BUILD FAILED in 22s
==== detail end ====
2021-10-25 21:27:00,058 DEBUG: Error encoutered, stopping by user request.