net.czlee.debatekeeper/lastbuild 27

From F-Droid
Jump to: navigation, search

Installed Android Tools

Build Log

'Build.py failed on server for net.czlee.debatekeeper:1.3-alpha.2'

detail

[...]
10-09 12:00:14,435 DEBUG: > sudo SUDO_FORCE_REMOVE=yes dpkg --purge sudo
(Reading database ... 65571 files and directories currently installed.)
Removing sudo (1.8.19p1-2.1+deb9u3) ...
Purging configuration files for sudo (1.8.19p1-2.1+deb9u3) ...
Processing triggers for systemd (232-25+deb9u13) ...
2021-10-09 12:00:17,837 INFO: Getting source for revision 8579b90358515306709a9f3b5ab0b6908bc4197c
2021-10-09 12:00:17,838 DEBUG: Directory: build/net.czlee.debatekeeper
2021-10-09 12:00:17,839 DEBUG: > git rev-parse --show-toplevel
2021-10-09 12:00:18,043 DEBUG: Directory: build/net.czlee.debatekeeper
2021-10-09 12:00:18,044 DEBUG: > git submodule foreach --recursive git reset --hard
2021-10-09 12:00:18,250 DEBUG: Directory: build/net.czlee.debatekeeper
2021-10-09 12:00:18,250 DEBUG: > git reset --hard
2021-10-09 12:00:18,455 DEBUG: Directory: build/net.czlee.debatekeeper
2021-10-09 12:00:18,456 DEBUG: > git submodule foreach --recursive git clean -dffx
2021-10-09 12:00:18,560 DEBUG: Directory: build/net.czlee.debatekeeper
2021-10-09 12:00:18,561 DEBUG: > git clean -dffx
2021-10-09 12:00:18,665 DEBUG: Directory: build/net.czlee.debatekeeper
2021-10-09 12:00:18,666 DEBUG: > git -c core.askpass=/bin/true -c core.sshCommand=/bin/false -c url.https://.insteadOf=ssh:// -c url.https://u:p@bitbucket.org/.insteadOf=git@bitbucket.org: -c url.https://u:p@bitbucket.org.insteadOf=git://bitbucket.org -c url.https://u:p@bitbucket.org.insteadOf=https://bitbucket.org -c url.https://u:p@github.com/.insteadOf=git@github.com: -c url.https://u:p@github.com.insteadOf=git://github.com -c url.https://u:p@github.com.insteadOf=https://github.com -c url.https://u:p@gitlab.com/.insteadOf=git@gitlab.com: -c url.https://u:p@gitlab.com.insteadOf=git://gitlab.com -c url.https://u:p@gitlab.com.insteadOf=https://gitlab.com fetch origin
2021-10-09 12:00:19,478 DEBUG: Directory: build/net.czlee.debatekeeper
2021-10-09 12:00:19,479 DEBUG: > git -c core.askpass=/bin/true -c core.sshCommand=/bin/false -c url.https://.insteadOf=ssh:// -c url.https://u:p@bitbucket.org/.insteadOf=git@bitbucket.org: -c url.https://u:p@bitbucket.org.insteadOf=git://bitbucket.org -c url.https://u:p@bitbucket.org.insteadOf=https://bitbucket.org -c url.https://u:p@github.com/.insteadOf=git@github.com: -c url.https://u:p@github.com.insteadOf=git://github.com -c url.https://u:p@github.com.insteadOf=https://github.com -c url.https://u:p@gitlab.com/.insteadOf=git@gitlab.com: -c url.https://u:p@gitlab.com.insteadOf=git://gitlab.com -c url.https://u:p@gitlab.com.insteadOf=https://gitlab.com fetch --prune --tags --force origin
2021-10-09 12:00:19,794 DEBUG: Directory: build/net.czlee.debatekeeper
2021-10-09 12:00:19,795 DEBUG: > git remote set-head origin --auto
2021-10-09 12:00:20,205 DEBUG: Directory: build/net.czlee.debatekeeper
2021-10-09 12:00:20,206 DEBUG: > git checkout -f 8579b90358515306709a9f3b5ab0b6908bc4197c
2021-10-09 12:00:20,412 DEBUG: Directory: build/net.czlee.debatekeeper
2021-10-09 12:00:20,413 DEBUG: > git clean -dffx
2021-10-09 12:00:20,518 INFO: Creating local.properties file at build/net.czlee.debatekeeper/local.properties
2021-10-09 12:00:20,519 INFO: Creating local.properties file at build/net.czlee.debatekeeper/app/local.properties
2021-10-09 12:00:20,520 DEBUG: Removing debuggable flags from build/net.czlee.debatekeeper/app
2021-10-09 12:00:20,531 INFO: Cleaning Gradle project...
2021-10-09 12:00:20,531 DEBUG: Directory: build/net.czlee.debatekeeper/app
2021-10-09 12:00:20,532 DEBUG: > /home/vagrant/fdroidserver/gradlew-fdroid clean
Found 7.0.2 via distributionUrl
Running /opt/gradle/versions/7.0.2/bin/gradle clean

Welcome to Gradle 7.0.2!

Here are the highlights of this release:
 - File system watching enabled by default
 - Support for running with and building Java 16 projects
 - Native support for Apple Silicon processors
 - Dependency catalog feature preview

For more details see https://docs.gradle.org/7.0.2/release-notes.html

To honour the JVM settings for this build a single-use Daemon process will be forked. See https://docs.gradle.org/7.0.2/userguide/gradle_daemon.html#sec:disabling_the_daemon.
Daemon will be stopped at the end of the build 

> Configure project :app
WARNING:API 'BaseVariant.getApplicationIdTextResource' is obsolete and has been replaced with 'VariantProperties.applicationId'.
It will be removed in version 7.0 of the Android Gradle plugin.
For more information, see TBD.
To determine what is calling BaseVariant.getApplicationIdTextResource, use -Pandroid.debug.obsoleteApi=true on the command line to display more information.

> Task :app:clean UP-TO-DATE

BUILD SUCCESSFUL in 29s
1 actionable task: 1 up-to-date
2021-10-09 12:00:50,281 INFO: Scanning source for common problems...
2021-10-09 12:00:50,287 INFO: Removing gradle-wrapper.jar at gradle/wrapper/gradle-wrapper.jar
2021-10-09 12:00:50,309 INFO: Creating source tarball...
2021-10-09 12:00:50,406 INFO: Building Gradle project...
2021-10-09 12:00:50,406 DEBUG: Directory: build/net.czlee.debatekeeper/app
2021-10-09 12:00:50,406 DEBUG: > /home/vagrant/fdroidserver/gradlew-fdroid assembleRelease
Found 7.0.2 via distributionUrl
Running /opt/gradle/versions/7.0.2/bin/gradle assembleRelease
To honour the JVM settings for this build a single-use Daemon process will be forked. See https://docs.gradle.org/7.0.2/userguide/gradle_daemon.html#sec:disabling_the_daemon.
Daemon will be stopped at the end of the build 

> Configure project :app
WARNING:API 'BaseVariant.getApplicationIdTextResource' is obsolete and has been replaced with 'VariantProperties.applicationId'.
It will be removed in version 7.0 of the Android Gradle plugin.
For more information, see TBD.
To determine what is calling BaseVariant.getApplicationIdTextResource, use -Pandroid.debug.obsoleteApi=true on the command line to display more information.
Checking the license for package Android SDK Build-Tools 30.0.3 in /opt/android-sdk/licenses
License for package Android SDK Build-Tools 30.0.3 accepted.
Preparing "Install Android SDK Build-Tools 30.0.3 (revision: 30.0.3)".
"Install Android SDK Build-Tools 30.0.3 (revision: 30.0.3)" ready.
Installing Android SDK Build-Tools 30.0.3 in /opt/android-sdk/build-tools/30.0.3
"Install Android SDK Build-Tools 30.0.3 (revision: 30.0.3)" complete.
"Install Android SDK Build-Tools 30.0.3 (revision: 30.0.3)" finished.
Checking the license for package Android SDK Platform 30 in /opt/android-sdk/licenses
License for package Android SDK Platform 30 accepted.
Preparing "Install Android SDK Platform 30 (revision: 3)".
"Install Android SDK Platform 30 (revision: 3)" ready.
Installing Android SDK Platform 30 in /opt/android-sdk/platforms/android-30
"Install Android SDK Platform 30 (revision: 3)" complete.
"Install Android SDK Platform 30 (revision: 3)" finished.

> Task :app:preBuild UP-TO-DATE
> Task :app:preReleaseBuild UP-TO-DATE
> Task :app:compileReleaseAidl NO-SOURCE
> Task :app:compileReleaseRenderscript NO-SOURCE
> Task :app:dataBindingMergeDependencyArtifactsRelease
> Task :app:dataBindingMergeGenClassesRelease
> Task :app:generateReleaseResValues
> Task :app:generateReleaseResources
> Task :app:generateReleaseBuildConfig
> Task :app:writeReleaseApplicationId
> Task :app:generateSafeArgsRelease
> Task :app:javaPreCompileRelease
> Task :app:checkReleaseAarMetadata
> Task :app:createReleaseCompatibleScreenManifests
> Task :app:extractDeepLinksRelease
> Task :app:mergeReleaseResources
> Task :app:processReleaseMainManifest
> Task :app:dataBindingGenBaseClassesRelease
> Task :app:processReleaseManifest
> Task :app:extractProguardFiles
> Task :app:mergeReleaseJniLibFolders
> Task :app:mergeReleaseNativeLibs NO-SOURCE
> Task :app:stripReleaseDebugSymbols NO-SOURCE
> Task :app:extractReleaseNativeSymbolTables NO-SOURCE
> Task :app:mergeReleaseNativeDebugMetadata NO-SOURCE
> Task :app:checkReleaseDuplicateClasses
> Task :app:desugarReleaseFileDependencies
> Task :app:mergeReleaseShaders
> Task :app:compileReleaseShaders NO-SOURCE
> Task :app:generateReleaseAssets UP-TO-DATE
> Task :app:mergeReleaseAssets
> Task :app:mergeReleaseArtProfile
> Task :app:processReleaseJavaRes NO-SOURCE
> Task :app:compressReleaseAssets
> Task :app:collectReleaseDependencies
> Task :app:sdkReleaseDependencyData
> Task :app:writeReleaseAppMetadata
> Task :app:writeReleaseSigningConfigVersions
> Task :app:processReleaseManifestForPackage
> Task :app:mergeExtDexRelease
> Task :app:processReleaseResources
> Task :app:mergeReleaseJavaResource

> Task :app:compileReleaseJavaWithJavac
/home/vagrant/build/net.czlee.debatekeeper/app/src/main/java/net/czlee/debatekeeper/debateformat/BellSoundInfo.java:45: error: cannot find symbol
    protected int[] mSoundResIds = {R.raw.desk_bell, R.raw.desk_bell_double, R.raw.desk_bell_triple};
                                     ^
  symbol:   variable raw
  location: class R
/home/vagrant/build/net.czlee.debatekeeper/app/src/main/java/net/czlee/debatekeeper/debateformat/BellSoundInfo.java:45: error: cannot find symbol
    protected int[] mSoundResIds = {R.raw.desk_bell, R.raw.desk_bell_double, R.raw.desk_bell_triple};
                                                      ^
  symbol:   variable raw
  location: class R
/home/vagrant/build/net.czlee.debatekeeper/app/src/main/java/net/czlee/debatekeeper/debateformat/BellSoundInfo.java:45: error: cannot find symbol
    protected int[] mSoundResIds = {R.raw.desk_bell, R.raw.desk_bell_double, R.raw.desk_bell_triple};
                                                                              ^
  symbol:   variable raw
  location: class R
Note: Some input files use or override a deprecated API.
Note: Recompile with -Xlint:deprecation for details.
3 errors

> Task :app:compileReleaseJavaWithJavac FAILED

FAILURE: Build failed with an exception.

* What went wrong:
Execution failed for task ':app:compileReleaseJavaWithJavac'.
> Compilation failed; see the compiler error output for details.

* Try:
Run with --stacktrace option to get the stack trace. Run with --info or --debug option to get more log output. Run with --scan to get full insights.

* Get more help at https://help.gradle.org

BUILD FAILED in 57s
31 actionable tasks: 31 executed
2021-10-09 12:01:48,531 DEBUG: Popen(['git', 'cat-file', '--batch-check'], cwd=/home/vagrant/build/net.czlee.debatekeeper, universal_newlines=False, shell=None)
2021-10-09 12:01:48,539 ERROR: Could not build app net.czlee.debatekeeper: Build failed for net.czlee.debatekeeper:1.3-alpha.2@8579b90358515306709a9f3b5ab0b6908bc4197c
==== detail begin ====
Found 7.0.2 via distributionUrl
Running /opt/gradle/versions/7.0.2/bin/gradle assembleRelease
To honour the JVM settings for this build a single-use Daemon process will be forked. See https://docs.gradle.org/7.0.2/userguide/gradle_daemon.html#sec:disabling_the_daemon.
Daemon will be stopped at the end of the build 

> Configure project :app
WARNING:API 'BaseVariant.getApplicationIdTextResource' is obsolete and has been replaced with 'VariantProperties.applicationId'.
It will be removed in version 7.0 of the Android Gradle plugin.
For more information, see TBD.
To determine what is calling BaseVariant.getApplicationIdTextResource, use -Pandroid.debug.obsoleteApi=true on the command line to display more information.
Checking the license for package Android SDK Build-Tools 30.0.3 in /opt/android-sdk/licenses
License for package Android SDK Build-Tools 30.0.3 accepted.
Preparing "Install Android SDK Build-Tools 30.0.3 (revision: 30.0.3)".
"Install Android SDK Build-Tools 30.0.3 (revision: 30.0.3)" ready.
Installing Android SDK Build-Tools 30.0.3 in /opt/android-sdk/build-tools/30.0.3
"Install Android SDK Build-Tools 30.0.3 (revision: 30.0.3)" complete.
"Install Android SDK Build-Tools 30.0.3 (revision: 30.0.3)" finished.
Checking the license for package Android SDK Platform 30 in /opt/android-sdk/licenses
License for package Android SDK Platform 30 accepted.
Preparing "Install Android SDK Platform 30 (revision: 3)".
"Install Android SDK Platform 30 (revision: 3)" ready.
Installing Android SDK Platform 30 in /opt/android-sdk/platforms/android-30
"Install Android SDK Platform 30 (revision: 3)" complete.
"Install Android SDK Platform 30 (revision: 3)" finished.

> Task :app:preBuild UP-TO-DATE
> Task :app:preReleaseBuild UP-TO-DATE
> Task :app:compileReleaseAidl NO-SOURCE
> Task :app:compileReleaseRenderscript NO-SOURCE
> Task :app:dataBindingMergeDependencyArtifactsRelease
> Task :app:dataBindingMergeGenClassesRelease
> Task :app:generateReleaseResValues
> Task :app:generateReleaseResources
> Task :app:generateReleaseBuildConfig
> Task :app:writeReleaseApplicationId
> Task :app:generateSafeArgsRelease
> Task :app:javaPreCompileRelease
> Task :app:checkReleaseAarMetadata
> Task :app:createReleaseCompatibleScreenManifests
> Task :app:extractDeepLinksRelease
> Task :app:mergeReleaseResources
> Task :app:processReleaseMainManifest
> Task :app:dataBindingGenBaseClassesRelease
> Task :app:processReleaseManifest
> Task :app:extractProguardFiles
> Task :app:mergeReleaseJniLibFolders
> Task :app:mergeReleaseNativeLibs NO-SOURCE
> Task :app:stripReleaseDebugSymbols NO-SOURCE
> Task :app:extractReleaseNativeSymbolTables NO-SOURCE
> Task :app:mergeReleaseNativeDebugMetadata NO-SOURCE
> Task :app:checkReleaseDuplicateClasses
> Task :app:desugarReleaseFileDependencies
> Task :app:mergeReleaseShaders
> Task :app:compileReleaseShaders NO-SOURCE
> Task :app:generateReleaseAssets UP-TO-DATE
> Task :app:mergeReleaseAssets
> Task :app:mergeReleaseArtProfile
> Task :app:processReleaseJavaRes NO-SOURCE
> Task :app:compressReleaseAssets
> Task :app:collectReleaseDependencies
> Task :app:sdkReleaseDependencyData
> Task :app:writeReleaseAppMetadata
> Task :app:writeReleaseSigningConfigVersions
> Task :app:processReleaseManifestForPackage
> Task :app:mergeExtDexRelease
> Task :app:processReleaseResources
> Task :app:mergeReleaseJavaResource

> Task :app:compileReleaseJavaWithJavac
/home/vagrant/build/net.czlee.debatekeeper/app/src/main/java/net/czlee/debatekeeper/debateformat/BellSoundInfo.java:45: error: cannot find symbol
    protected int[] mSoundResIds = {R.raw.desk_bell, R.raw.desk_bell_double, R.raw.desk_bell_triple};
                                     ^
  symbol:   variable raw
  location: class R
/home/vagrant/build/net.czlee.debatekeeper/app/src/main/java/net/czlee/debatekeeper/debateformat/BellSoundInfo.java:45: error: cannot find symbol
    protected int[] mSoundResIds = {R.raw.desk_bell, R.raw.desk_bell_double, R.raw.desk_bell_triple};
                                                      ^
  symbol:   variable raw
  location: class R
/home/vagrant/build/net.czlee.debatekeeper/app/src/main/java/net/czlee/debatekeeper/debateformat/BellSoundInfo.java:45: error: cannot find symbol
    protected int[] mSoundResIds = {R.raw.desk_bell, R.raw.desk_bell_double, R.raw.desk_bell_triple};
                                                                              ^
  symbol:   variable raw
  location: class R
Note: Some input files use or override a deprecated API.
Note: Recompile with -Xlint:deprecation for details.
3 errors

> Task :app:compileReleaseJavaWithJavac FAILED

FAILURE: Build failed with an exception.

* What went wrong:
Execution failed for task ':app:compileReleaseJavaWithJavac'.
> Compilation failed; see the compiler error output for details.

* Try:
Run with --stacktrace option to get the stack trace. Run with --info or --debug option to get more log output. Run with --scan to get full insights.

* Get more help at https://help.gradle.org

BUILD FAILED in 57s
31 actionable tasks: 31 executed
==== detail end ====
2021-10-09 12:01:48,540 DEBUG: Error encoutered, stopping by user request.