org.adaway/lastbuild 40205

From F-Droid
(Redirected from org.adaway/lastbuild)
Jump to: navigation, search

Installed Android Tools

Build Log

'Build.py failed on server for org.adaway:4.2.5'

detail

[...]
mediates/merged_native_libs/release/out/lib/x86/libandroid_gradle_generate_ndk_build_json_x86.command.txt_exec.so: File format not recognized

Unable to strip library /home/vagrant/build/org.adaway/tcpdump/build/intermediates/merged_native_libs/release/out/lib/x86/libandroid_gradle_generate_ndk_build_json_x86.command.txt_exec.so due to error 1 returned from /home/vagrant/android-ndk/r18b/toolchains/x86-4.9/prebuilt/linux-x86_64/bin/i686-linux-android-strip, packaging it as is.
Unable to strip library /home/vagrant/build/org.adaway/tcpdump/build/intermediates/merged_native_libs/release/out/lib/x86/libandroid_gradle_generate_ndk_build_json_x86.stderr.txt_exec.so due to error 1 returned from /home/vagrant/android-ndk/r18b/toolchains/x86-4.9/prebuilt/linux-x86_64/bin/i686-linux-android-strip, packaging it as is.
/home/vagrant/android-ndk/r18b/toolchains/aarch64-linux-android-4.9/prebuilt/linux-x86_64/bin/aarch64-linux-android-strip:/home/vagrant/build/org.adaway/tcpdump/build/intermediates/merged_native_libs/release/out/lib/arm64-v8a/libandroid_gradle_generate_ndk_build_json_arm64-v8a.command.txt_exec.so: File format not recognized

Unable to strip library /home/vagrant/build/org.adaway/tcpdump/build/intermediates/merged_native_libs/release/out/lib/arm64-v8a/libandroid_gradle_generate_ndk_build_json_arm64-v8a.command.txt_exec.so due to error 1 returned from /home/vagrant/android-ndk/r18b/toolchains/aarch64-linux-android-4.9/prebuilt/linux-x86_64/bin/aarch64-linux-android-strip, packaging it as is.
/home/vagrant/android-ndk/r18b/toolchains/aarch64-linux-android-4.9/prebuilt/linux-x86_64/bin/aarch64-linux-android-strip:/home/vagrant/build/org.adaway/tcpdump/build/intermediates/merged_native_libs/release/out/lib/arm64-v8a/libandroid_gradle_generate_ndk_build_json_arm64-v8a.stdout.txt_exec.so: File format not recognized

Unable to strip library /home/vagrant/build/org.adaway/tcpdump/build/intermediates/merged_native_libs/release/out/lib/arm64-v8a/libandroid_gradle_generate_ndk_build_json_arm64-v8a.stdout.txt_exec.so due to error 1 returned from /home/vagrant/android-ndk/r18b/toolchains/aarch64-linux-android-4.9/prebuilt/linux-x86_64/bin/aarch64-linux-android-strip, packaging it as is.

> Task :tcpdump:transformNativeLibsWithIntermediateJniLibsForRelease

> Task :webserver:externalNativeBuildRelease
Build multiple targets blank_webserver_exec_armeabi-v7a blank_webserver_armeabi-v7a
[armeabi-v7a] Compile thumb  : blank_webserver <= blank_webserver.c
[armeabi-v7a] Compile thumb  : blank_webserver <= mongoose.c
/home/vagrant/build/org.adaway/webserver/jni/mongoose/mongoose.c:6730:9: warning: implicit declaration of function 'fseeko' is invalid in C99 [-Wimplicit-function-declaration]
        fseeko(pd->file.fp, r1, SEEK_SET);
        ^
1 warning generated.
[armeabi-v7a] Executable     : blank_webserver
[armeabi-v7a] Compile thumb  : blank_webserver_exec <= stub.c
[armeabi-v7a] SharedLibrary  : libblank_webserver_exec.so
Build multiple targets blank_webserver_arm64-v8a blank_webserver_exec_arm64-v8a
[arm64-v8a] Compile        : blank_webserver <= blank_webserver.c
[arm64-v8a] Compile        : blank_webserver <= mongoose.c
[arm64-v8a] Executable     : blank_webserver
[arm64-v8a] Compile        : blank_webserver_exec <= stub.c
[arm64-v8a] SharedLibrary  : libblank_webserver_exec.so
Build multiple targets blank_webserver_x86 blank_webserver_exec_x86
[x86] Compile        : blank_webserver <= blank_webserver.c
[x86] Compile        : blank_webserver <= mongoose.c
/home/vagrant/build/org.adaway/webserver/jni/mongoose/mongoose.c:6730:9: warning: implicit declaration of function 'fseeko' is invalid in C99 [-Wimplicit-function-declaration]
        fseeko(pd->file.fp, r1, SEEK_SET);
        ^
1 warning generated.
[x86] Executable     : blank_webserver
[x86] Compile        : blank_webserver_exec <= stub.c
[x86] SharedLibrary  : libblank_webserver_exec.so
Build multiple targets blank_webserver_x86_64 blank_webserver_exec_x86_64
[x86_64] Compile        : blank_webserver <= blank_webserver.c
[x86_64] Compile        : blank_webserver <= mongoose.c
[x86_64] Executable     : blank_webserver
[x86_64] Compile        : blank_webserver_exec <= stub.c
[x86_64] SharedLibrary  : libblank_webserver_exec.so
Replacing x86_64/libtcpdump_exec.so from ndkBuild directory
Replacing x86_64/libandroid_gradle_generate_ndk_build_json_x86_64.command.txt_exec.so from ndkBuild directory
Replacing x86_64/libandroid_gradle_generate_ndk_build_json_x86_64.stderr.txt_exec.so from ndkBuild directory
Replacing x86_64/libandroid_gradle_generate_ndk_build_json_x86_64.stdout.txt_exec.so from ndkBuild directory
Replacing armeabi-v7a/libtcpdump_exec.so from ndkBuild directory
Replacing armeabi-v7a/libandroid_gradle_generate_ndk_build_json_armeabi-v7a.stderr.txt_exec.so from ndkBuild directory
Replacing armeabi-v7a/libandroid_gradle_generate_ndk_build_json_armeabi-v7a.stdout.txt_exec.so from ndkBuild directory
Replacing armeabi-v7a/libandroid_gradle_generate_ndk_build_json_armeabi-v7a.command.txt_exec.so from ndkBuild directory
Replacing x86/libandroid_gradle_generate_ndk_build_json_x86.command.txt_exec.so from ndkBuild directory
Replacing x86/libtcpdump_exec.so from ndkBuild directory
Replacing x86/libandroid_gradle_generate_ndk_build_json_x86.stdout.txt_exec.so from ndkBuild directory
Replacing x86/libandroid_gradle_generate_ndk_build_json_x86.stderr.txt_exec.so from ndkBuild directory
Replacing arm64-v8a/libtcpdump_exec.so from ndkBuild directory
Replacing arm64-v8a/libandroid_gradle_generate_ndk_build_json_arm64-v8a.command.txt_exec.so from ndkBuild directory
Replacing arm64-v8a/libandroid_gradle_generate_ndk_build_json_arm64-v8a.stderr.txt_exec.so from ndkBuild directory
Replacing arm64-v8a/libandroid_gradle_generate_ndk_build_json_arm64-v8a.stdout.txt_exec.so from ndkBuild directory
Replacing x86_64/libblank_webserver_exec.so from ndkBuild directory
Replacing x86_64/libandroid_gradle_generate_ndk_build_json_x86_64.command.txt_exec.so from ndkBuild directory
Replacing x86_64/libandroid_gradle_generate_ndk_build_json_x86_64.stderr.txt_exec.so from ndkBuild directory
Replacing x86_64/libandroid_gradle_generate_ndk_build_json_x86_64.stdout.txt_exec.so from ndkBuild directory
Replacing armeabi-v7a/libblank_webserver_exec.so from ndkBuild directory
Replacing armeabi-v7a/libandroid_gradle_generate_ndk_build_json_armeabi-v7a.stderr.txt_exec.so from ndkBuild directory
Replacing armeabi-v7a/libandroid_gradle_generate_ndk_build_json_armeabi-v7a.stdout.txt_exec.so from ndkBuild directory
Replacing armeabi-v7a/libandroid_gradle_generate_ndk_build_json_armeabi-v7a.command.txt_exec.so from ndkBuild directory
Replacing x86/libblank_webserver_exec.so from ndkBuild directory
Replacing x86/libandroid_gradle_generate_ndk_build_json_x86.command.txt_exec.so from ndkBuild directory
Replacing x86/libandroid_gradle_generate_ndk_build_json_x86.stdout.txt_exec.so from ndkBuild directory
Replacing x86/libandroid_gradle_generate_ndk_build_json_x86.stderr.txt_exec.so from ndkBuild directory
Replacing arm64-v8a/libblank_webserver_exec.so from ndkBuild directory
Replacing arm64-v8a/libandroid_gradle_generate_ndk_build_json_arm64-v8a.command.txt_exec.so from ndkBuild directory
Replacing arm64-v8a/libandroid_gradle_generate_ndk_build_json_arm64-v8a.stderr.txt_exec.so from ndkBuild directory
Replacing arm64-v8a/libandroid_gradle_generate_ndk_build_json_arm64-v8a.stdout.txt_exec.so from ndkBuild directory

> Task :webserver:mergeReleaseJniLibFolders
> Task :libraries:RootCommands:processReleaseJavaRes NO-SOURCE
> Task :libraries:RootCommands:bundleLibResRelease
> Task :libraries:RootCommands:mergeReleaseJniLibFolders
> Task :libraries:RootCommands:mergeReleaseNativeLibs
> Task :libraries:RootCommands:stripReleaseDebugSymbols
> Task :libraries:RootCommands:transformNativeLibsWithIntermediateJniLibsForRelease
> Task :webserver:mergeReleaseNativeLibs
Unable to strip library /home/vagrant/build/org.adaway/webserver/build/intermediates/merged_native_libs/release/out/lib/x86_64/libandroid_gradle_generate_ndk_build_json_x86_64.stderr.txt_exec.so due to error 1 returned from /home/vagrant/android-ndk/r18b/toolchains/x86_64-4.9/prebuilt/linux-x86_64/bin/x86_64-linux-android-strip, packaging it as is.
/home/vagrant/android-ndk/r18b/toolchains/arm-linux-androideabi-4.9/prebuilt/linux-x86_64/bin/arm-linux-androideabi-strip:/home/vagrant/build/org.adaway/webserver/build/intermediates/merged_native_libs/release/out/lib/armeabi-v7a/libandroid_gradle_generate_ndk_build_json_armeabi-v7a.command.txt_exec.so: File format not recognized

Unable to strip library /home/vagrant/build/org.adaway/webserver/build/intermediates/merged_native_libs/release/out/lib/armeabi-v7a/libandroid_gradle_generate_ndk_build_json_armeabi-v7a.command.txt_exec.so due to error 1 returned from /home/vagrant/android-ndk/r18b/toolchains/arm-linux-androideabi-4.9/prebuilt/linux-x86_64/bin/arm-linux-androideabi-strip, packaging it as is.
/home/vagrant/android-ndk/r18b/toolchains/x86-4.9/prebuilt/linux-x86_64/bin/i686-linux-android-strip:/home/vagrant/build/org.adaway/webserver/build/intermediates/merged_native_libs/release/out/lib/x86/libandroid_gradle_generate_ndk_build_json_x86.stdout.txt_exec.so: File format not recognized

Unable to strip library /home/vagrant/build/org.adaway/webserver/build/intermediates/merged_native_libs/release/out/lib/x86/libandroid_gradle_generate_ndk_build_json_x86.stdout.txt_exec.so due to error 1 returned from /home/vagrant/android-ndk/r18b/toolchains/x86-4.9/prebuilt/linux-x86_64/bin/i686-linux-android-strip, packaging it as is.

> Task :webserver:stripReleaseDebugSymbols
/home/vagrant/android-ndk/r18b/toolchains/x86_64-4.9/prebuilt/linux-x86_64/bin/x86_64-linux-android-strip:/home/vagrant/build/org.adaway/webserver/build/intermediates/merged_native_libs/release/out/lib/x86_64/libandroid_gradle_generate_ndk_build_json_x86_64.command.txt_exec.so: File format not recognized

Unable to strip library /home/vagrant/build/org.adaway/webserver/build/intermediates/merged_native_libs/release/out/lib/x86_64/libandroid_gradle_generate_ndk_build_json_x86_64.command.txt_exec.so due to error 1 returned from /home/vagrant/android-ndk/r18b/toolchains/x86_64-4.9/prebuilt/linux-x86_64/bin/x86_64-linux-android-strip, packaging it as is.
/home/vagrant/android-ndk/r18b/toolchains/x86_64-4.9/prebuilt/linux-x86_64/bin/x86_64-linux-android-strip:/home/vagrant/build/org.adaway/webserver/build/intermediates/merged_native_libs/release/out/lib/x86_64/libandroid_gradle_generate_ndk_build_json_x86_64.stdout.txt_exec.so: File format not recognized

Unable to strip library /home/vagrant/build/org.adaway/webserver/build/intermediates/merged_native_libs/release/out/lib/x86_64/libandroid_gradle_generate_ndk_build_json_x86_64.stdout.txt_exec.so due to error 1 returned from /home/vagrant/android-ndk/r18b/toolchains/x86_64-4.9/prebuilt/linux-x86_64/bin/x86_64-linux-android-strip, packaging it as is.
Unable to strip library /home/vagrant/build/org.adaway/webserver/build/intermediates/merged_native_libs/release/out/lib/armeabi-v7a/libandroid_gradle_generate_ndk_build_json_armeabi-v7a.stderr.txt_exec.so due to error 1 returned from /home/vagrant/android-ndk/r18b/toolchains/arm-linux-androideabi-4.9/prebuilt/linux-x86_64/bin/arm-linux-androideabi-strip, packaging it as is.
/home/vagrant/android-ndk/r18b/toolchains/arm-linux-androideabi-4.9/prebuilt/linux-x86_64/bin/arm-linux-androideabi-strip:/home/vagrant/build/org.adaway/webserver/build/intermediates/merged_native_libs/release/out/lib/armeabi-v7a/libandroid_gradle_generate_ndk_build_json_armeabi-v7a.stdout.txt_exec.so: File format not recognized

Unable to strip library /home/vagrant/build/org.adaway/webserver/build/intermediates/merged_native_libs/release/out/lib/armeabi-v7a/libandroid_gradle_generate_ndk_build_json_armeabi-v7a.stdout.txt_exec.so due to error 1 returned from /home/vagrant/android-ndk/r18b/toolchains/arm-linux-androideabi-4.9/prebuilt/linux-x86_64/bin/arm-linux-androideabi-strip, packaging it as is.
/home/vagrant/android-ndk/r18b/toolchains/x86-4.9/prebuilt/linux-x86_64/bin/i686-linux-android-strip:/home/vagrant/build/org.adaway/webserver/build/intermediates/merged_native_libs/release/out/lib/x86/libandroid_gradle_generate_ndk_build_json_x86.command.txt_exec.so: File format not recognized

Unable to strip library /home/vagrant/build/org.adaway/webserver/build/intermediates/merged_native_libs/release/out/lib/x86/libandroid_gradle_generate_ndk_build_json_x86.command.txt_exec.so due to error 1 returned from /home/vagrant/android-ndk/r18b/toolchains/x86-4.9/prebuilt/linux-x86_64/bin/i686-linux-android-strip, packaging it as is.
Unable to strip library /home/vagrant/build/org.adaway/webserver/build/intermediates/merged_native_libs/release/out/lib/x86/libandroid_gradle_generate_ndk_build_json_x86.stderr.txt_exec.so due to error 1 returned from /home/vagrant/android-ndk/r18b/toolchains/x86-4.9/prebuilt/linux-x86_64/bin/i686-linux-android-strip, packaging it as is.
/home/vagrant/android-ndk/r18b/toolchains/aarch64-linux-android-4.9/prebuilt/linux-x86_64/bin/aarch64-linux-android-strip:/home/vagrant/build/org.adaway/webserver/build/intermediates/merged_native_libs/release/out/lib/arm64-v8a/libandroid_gradle_generate_ndk_build_json_arm64-v8a.command.txt_exec.so: File format not recognized

Unable to strip library /home/vagrant/build/org.adaway/webserver/build/intermediates/merged_native_libs/release/out/lib/arm64-v8a/libandroid_gradle_generate_ndk_build_json_arm64-v8a.command.txt_exec.so due to error 1 returned from /home/vagrant/android-ndk/r18b/toolchains/aarch64-linux-android-4.9/prebuilt/linux-x86_64/bin/aarch64-linux-android-strip, packaging it as is.
Unable to strip library /home/vagrant/build/org.adaway/webserver/build/intermediates/merged_native_libs/release/out/lib/arm64-v8a/libandroid_gradle_generate_ndk_build_json_arm64-v8a.stderr.txt_exec.so due to error 1 returned from /home/vagrant/android-ndk/r18b/toolchains/aarch64-linux-android-4.9/prebuilt/linux-x86_64/bin/aarch64-linux-android-strip, packaging it as is.
/home/vagrant/android-ndk/r18b/toolchains/aarch64-linux-android-4.9/prebuilt/linux-x86_64/bin/aarch64-linux-android-strip:/home/vagrant/build/org.adaway/webserver/build/intermediates/merged_native_libs/release/out/lib/arm64-v8a/libandroid_gradle_generate_ndk_build_json_arm64-v8a.stdout.txt_exec.so: File format not recognized

Unable to strip library /home/vagrant/build/org.adaway/webserver/build/intermediates/merged_native_libs/release/out/lib/arm64-v8a/libandroid_gradle_generate_ndk_build_json_arm64-v8a.stdout.txt_exec.so due to error 1 returned from /home/vagrant/android-ndk/r18b/toolchains/aarch64-linux-android-4.9/prebuilt/linux-x86_64/bin/aarch64-linux-android-strip, packaging it as is.

> Task :webserver:transformNativeLibsWithIntermediateJniLibsForRelease
> Task :app:mergeReleaseGeneratedProguardFiles
> Task :app:mergeReleaseNativeLibs FAILED

FAILURE: Build failed with an exception.

* What went wrong:
Execution failed for task ':app:mergeReleaseNativeLibs'.
> A failure occurred while executing com.android.build.gradle.internal.tasks.Workers$ActionFacade
   > More than one file was found with OS independent path 'lib/x86_64/libandroid_gradle_generate_ndk_build_json_x86_64.stdout.txt_exec.so'

* Try:
Run with --stacktrace option to get the stack trace. Run with --info or --debug option to get more log output. Run with --scan to get full insights.

* Get more help at https://help.gradle.org

Deprecated Gradle features were used in this build, making it incompatible with Gradle 6.0.
Use '--warning-mode all' to show the individual deprecation warnings.
See https://docs.gradle.org/5.4.1/userguide/command_line_interface.html#sec:command_line_warnings

BUILD FAILED in 7m 56s
81 actionable tasks: 81 executed
==== detail end ====