org.commonvoice.saverio/lastbuild 77

From F-Droid
Jump to: navigation, search

Installed Android Tools

Build Log

'Build.py failed on server for org.commonvoice.saverio:0.2.5b'

detail

[...]
 'nValidated' initializer is redundant
w: /home/vagrant/build/org.commonvoice.saverio/app/src/main/java/org/commonvoice/saverio/ListenActivity.kt: (478, 13): Variable 'btnYes' is never used
w: /home/vagrant/build/org.commonvoice.saverio/app/src/main/java/org/commonvoice/saverio/ListenActivity.kt: (552, 25): Variable 'json_result' is never used
w: /home/vagrant/build/org.commonvoice.saverio/app/src/main/java/org/commonvoice/saverio/ListenActivity.kt: (724, 13): Variable 'intent' is never used
w: /home/vagrant/build/org.commonvoice.saverio/app/src/main/java/org/commonvoice/saverio/ListenActivity.kt: (732, 20): Unsafe use of a nullable receiver of type String?
w: /home/vagrant/build/org.commonvoice.saverio/app/src/main/java/org/commonvoice/saverio/ListenActivity.kt: (753, 23): 'locale: Locale!' is deprecated. Deprecated in Java
w: /home/vagrant/build/org.commonvoice.saverio/app/src/main/java/org/commonvoice/saverio/LoginActivity.kt: (74, 17): Variable 'intent' is never used
w: /home/vagrant/build/org.commonvoice.saverio/app/src/main/java/org/commonvoice/saverio/LoginActivity.kt: (79, 13): Variable 'txtLevel' is never used
w: /home/vagrant/build/org.commonvoice.saverio/app/src/main/java/org/commonvoice/saverio/LoginActivity.kt: (90, 21): Unsafe use of a nullable receiver of type Uri?
w: /home/vagrant/build/org.commonvoice.saverio/app/src/main/java/org/commonvoice/saverio/LoginActivity.kt: (91, 36): Unsafe use of a nullable receiver of type Uri?
w: /home/vagrant/build/org.commonvoice.saverio/app/src/main/java/org/commonvoice/saverio/LoginActivity.kt: (129, 33): Variable 'nameLevel' initializer is redundant
w: /home/vagrant/build/org.commonvoice.saverio/app/src/main/java/org/commonvoice/saverio/LoginActivity.kt: (358, 13): Variable 'intent' is never used
w: /home/vagrant/build/org.commonvoice.saverio/app/src/main/java/org/commonvoice/saverio/LoginActivity.kt: (378, 17): Variable 'profileImage' is never used
w: /home/vagrant/build/org.commonvoice.saverio/app/src/main/java/org/commonvoice/saverio/LoginActivity.kt: (474, 38): Type mismatch: inferred type is String? but String was expected
w: /home/vagrant/build/org.commonvoice.saverio/app/src/main/java/org/commonvoice/saverio/LoginActivity.kt: (649, 13): Variable 'intent' is never used
w: /home/vagrant/build/org.commonvoice.saverio/app/src/main/java/org/commonvoice/saverio/LoginActivity.kt: (668, 20): Unsafe use of a nullable receiver of type String?
w: /home/vagrant/build/org.commonvoice.saverio/app/src/main/java/org/commonvoice/saverio/LoginActivity.kt: (689, 23): 'locale: Locale!' is deprecated. Deprecated in Java
w: /home/vagrant/build/org.commonvoice.saverio/app/src/main/java/org/commonvoice/saverio/MainActivity.kt: (100, 13): Type mismatch: inferred type is String? but String was expected
w: /home/vagrant/build/org.commonvoice.saverio/app/src/main/java/org/commonvoice/saverio/MainActivity.kt: (128, 17): Type mismatch: inferred type is String? but String was expected
w: /home/vagrant/build/org.commonvoice.saverio/app/src/main/java/org/commonvoice/saverio/MainActivity.kt: (129, 29): Type mismatch: inferred type is String? but String was expected
w: /home/vagrant/build/org.commonvoice.saverio/app/src/main/java/org/commonvoice/saverio/MainActivity.kt: (155, 17): Type mismatch: inferred type is String? but String was expected
w: /home/vagrant/build/org.commonvoice.saverio/app/src/main/java/org/commonvoice/saverio/MainActivity.kt: (157, 29): Type mismatch: inferred type is String? but String was expected
w: /home/vagrant/build/org.commonvoice.saverio/app/src/main/java/org/commonvoice/saverio/MainActivity.kt: (165, 36): Type mismatch: inferred type is String? but String was expected
w: /home/vagrant/build/org.commonvoice.saverio/app/src/main/java/org/commonvoice/saverio/MainActivity.kt: (171, 21): Type mismatch: inferred type is String? but String was expected
w: /home/vagrant/build/org.commonvoice.saverio/app/src/main/java/org/commonvoice/saverio/MainActivity.kt: (177, 21): Type mismatch: inferred type is String? but String was expected
w: /home/vagrant/build/org.commonvoice.saverio/app/src/main/java/org/commonvoice/saverio/MainActivity.kt: (183, 21): Type mismatch: inferred type is String? but String was expected
w: /home/vagrant/build/org.commonvoice.saverio/app/src/main/java/org/commonvoice/saverio/MainActivity.kt: (237, 25): Type mismatch: inferred type is String? but String was expected
w: /home/vagrant/build/org.commonvoice.saverio/app/src/main/java/org/commonvoice/saverio/MainActivity.kt: (243, 25): Type mismatch: inferred type is String? but String was expected
w: /home/vagrant/build/org.commonvoice.saverio/app/src/main/java/org/commonvoice/saverio/MainActivity.kt: (249, 25): Type mismatch: inferred type is String? but String was expected
w: /home/vagrant/build/org.commonvoice.saverio/app/src/main/java/org/commonvoice/saverio/MainActivity.kt: (255, 25): Type mismatch: inferred type is String? but String was expected
w: /home/vagrant/build/org.commonvoice.saverio/app/src/main/java/org/commonvoice/saverio/MainActivity.kt: (263, 25): Type mismatch: inferred type is String? but String was expected
w: /home/vagrant/build/org.commonvoice.saverio/app/src/main/java/org/commonvoice/saverio/MainActivity.kt: (269, 25): Type mismatch: inferred type is String? but String was expected
w: /home/vagrant/build/org.commonvoice.saverio/app/src/main/java/org/commonvoice/saverio/MainActivity.kt: (275, 25): Type mismatch: inferred type is String? but String was expected
w: /home/vagrant/build/org.commonvoice.saverio/app/src/main/java/org/commonvoice/saverio/MainActivity.kt: (281, 25): Type mismatch: inferred type is String? but String was expected
w: /home/vagrant/build/org.commonvoice.saverio/app/src/main/java/org/commonvoice/saverio/MainActivity.kt: (340, 21): Type mismatch: inferred type is String? but String was expected
w: /home/vagrant/build/org.commonvoice.saverio/app/src/main/java/org/commonvoice/saverio/MainActivity.kt: (346, 21): Type mismatch: inferred type is String? but String was expected
w: /home/vagrant/build/org.commonvoice.saverio/app/src/main/java/org/commonvoice/saverio/MainActivity.kt: (352, 21): Type mismatch: inferred type is String? but String was expected
w: /home/vagrant/build/org.commonvoice.saverio/app/src/main/java/org/commonvoice/saverio/MainActivity.kt: (358, 21): Type mismatch: inferred type is String? but String was expected
w: /home/vagrant/build/org.commonvoice.saverio/app/src/main/java/org/commonvoice/saverio/MainActivity.kt: (372, 17): Variable 'sharedPref' is never used
w: /home/vagrant/build/org.commonvoice.saverio/app/src/main/java/org/commonvoice/saverio/MainActivity.kt: (446, 13): Variable 'intent' is never used
w: /home/vagrant/build/org.commonvoice.saverio/app/src/main/java/org/commonvoice/saverio/MainActivity.kt: (460, 13): Variable 'intent' is never used
w: /home/vagrant/build/org.commonvoice.saverio/app/src/main/java/org/commonvoice/saverio/MainActivity.kt: (467, 13): Variable 'intent' is never used
w: /home/vagrant/build/org.commonvoice.saverio/app/src/main/java/org/commonvoice/saverio/MainActivity.kt: (475, 13): Variable 'intent' is never used
w: /home/vagrant/build/org.commonvoice.saverio/app/src/main/java/org/commonvoice/saverio/MainActivity.kt: (481, 13): Variable 'intent' is never used
w: /home/vagrant/build/org.commonvoice.saverio/app/src/main/java/org/commonvoice/saverio/MainActivity.kt: (551, 17): Variable 'intent' is never used
w: /home/vagrant/build/org.commonvoice.saverio/app/src/main/java/org/commonvoice/saverio/MainActivity.kt: (612, 13): Variable 'intent' is never used
w: /home/vagrant/build/org.commonvoice.saverio/app/src/main/java/org/commonvoice/saverio/MainActivity.kt: (628, 13): Variable 'intent' is never used
w: /home/vagrant/build/org.commonvoice.saverio/app/src/main/java/org/commonvoice/saverio/MainActivity.kt: (665, 33): Variable 'todayDate' initializer is redundant
w: /home/vagrant/build/org.commonvoice.saverio/app/src/main/java/org/commonvoice/saverio/MainActivity.kt: (702, 32): Unsafe use of a nullable receiver of type String?
w: /home/vagrant/build/org.commonvoice.saverio/app/src/main/java/org/commonvoice/saverio/MainActivity.kt: (708, 38): Variable 'nValidated' initializer is redundant
w: /home/vagrant/build/org.commonvoice.saverio/app/src/main/java/org/commonvoice/saverio/MainActivity.kt: (709, 37): Variable 'nRecorded' initializer is redundant
w: /home/vagrant/build/org.commonvoice.saverio/app/src/main/java/org/commonvoice/saverio/MainActivity.kt: (741, 20): Unsafe use of a nullable receiver of type String?
w: /home/vagrant/build/org.commonvoice.saverio/app/src/main/java/org/commonvoice/saverio/MainActivity.kt: (765, 23): 'locale: Locale!' is deprecated. Deprecated in Java
w: /home/vagrant/build/org.commonvoice.saverio/app/src/main/java/org/commonvoice/saverio/NoConnectionActivity.kt: (77, 20): Unsafe use of a nullable receiver of type String?
w: /home/vagrant/build/org.commonvoice.saverio/app/src/main/java/org/commonvoice/saverio/NoConnectionActivity.kt: (98, 23): 'locale: Locale!' is deprecated. Deprecated in Java
w: /home/vagrant/build/org.commonvoice.saverio/app/src/main/java/org/commonvoice/saverio/NotAvailableNow.kt: (41, 20): Unsafe use of a nullable receiver of type String?
w: /home/vagrant/build/org.commonvoice.saverio/app/src/main/java/org/commonvoice/saverio/NotAvailableNow.kt: (62, 23): 'locale: Locale!' is deprecated. Deprecated in Java
w: /home/vagrant/build/org.commonvoice.saverio/app/src/main/java/org/commonvoice/saverio/RestartActivity.kt: (57, 13): Variable 'intent' is never used
w: /home/vagrant/build/org.commonvoice.saverio/app/src/main/java/org/commonvoice/saverio/RestartActivity.kt: (69, 20): Unsafe use of a nullable receiver of type String?
w: /home/vagrant/build/org.commonvoice.saverio/app/src/main/java/org/commonvoice/saverio/RestartActivity.kt: (90, 23): 'locale: Locale!' is deprecated. Deprecated in Java
w: /home/vagrant/build/org.commonvoice.saverio/app/src/main/java/org/commonvoice/saverio/SpeakActivity.kt: (87, 17): Variable 'intent' is never used
w: /home/vagrant/build/org.commonvoice.saverio/app/src/main/java/org/commonvoice/saverio/SpeakActivity.kt: (96, 17): Type mismatch: inferred type is String? but String was expected
w: /home/vagrant/build/org.commonvoice.saverio/app/src/main/java/org/commonvoice/saverio/SpeakActivity.kt: (149, 33): Variable 'todayDate' initializer is redundant
w: /home/vagrant/build/org.commonvoice.saverio/app/src/main/java/org/commonvoice/saverio/SpeakActivity.kt: (186, 32): Unsafe use of a nullable receiver of type String?
w: /home/vagrant/build/org.commonvoice.saverio/app/src/main/java/org/commonvoice/saverio/SpeakActivity.kt: (192, 37): Variable 'nRecorded' initializer is redundant
w: /home/vagrant/build/org.commonvoice.saverio/app/src/main/java/org/commonvoice/saverio/SpeakActivity.kt: (514, 35): Variable 'encoded' initializer is redundant
w: /home/vagrant/build/org.commonvoice.saverio/app/src/main/java/org/commonvoice/saverio/SpeakActivity.kt: (551, 17): Variable 'params' is never used
w: /home/vagrant/build/org.commonvoice.saverio/app/src/main/java/org/commonvoice/saverio/SpeakActivity.kt: (558, 25): Variable 'json_result' is never used
w: /home/vagrant/build/org.commonvoice.saverio/app/src/main/java/org/commonvoice/saverio/SpeakActivity.kt: (607, 37): Variable 'formatted' initializer is redundant
w: /home/vagrant/build/org.commonvoice.saverio/app/src/main/java/org/commonvoice/saverio/SpeakActivity.kt: (634, 22): Parameter 'context' is never used
w: /home/vagrant/build/org.commonvoice.saverio/app/src/main/java/org/commonvoice/saverio/SpeakActivity.kt: (734, 13): Variable 'intent' is never used
w: /home/vagrant/build/org.commonvoice.saverio/app/src/main/java/org/commonvoice/saverio/SpeakActivity.kt: (742, 20): Unsafe use of a nullable receiver of type String?
w: /home/vagrant/build/org.commonvoice.saverio/app/src/main/java/org/commonvoice/saverio/SpeakActivity.kt: (763, 23): 'locale: Locale!' is deprecated. Deprecated in Java
w: /home/vagrant/build/org.commonvoice.saverio/app/src/main/java/org/commonvoice/saverio/TutorialActivity.kt: (89, 17): Variable 'intent' is never used
w: /home/vagrant/build/org.commonvoice.saverio/app/src/main/java/org/commonvoice/saverio/WebBrowser.kt: (58, 13): Variable 'intent' is never used
w: /home/vagrant/build/org.commonvoice.saverio/app/src/main/java/org/commonvoice/saverio/ui/dashboard/DashboardFragment.kt: (86, 36): Variable 'labelNow' initializer is redundant
w: /home/vagrant/build/org.commonvoice.saverio/app/src/main/java/org/commonvoice/saverio/ui/dashboard/DashboardFragment.kt: (87, 39): Variable 'labelBefore' initializer is redundant
w: /home/vagrant/build/org.commonvoice.saverio/app/src/main/java/org/commonvoice/saverio/ui/dashboard/DashboardFragment.kt: (259, 25): Name shadowed: main
w: /home/vagrant/build/org.commonvoice.saverio/app/src/main/java/org/commonvoice/saverio/ui/dashboard/DashboardFragment.kt: (276, 32): Variable 'newStats' initializer is redundant
w: /home/vagrant/build/org.commonvoice.saverio/app/src/main/java/org/commonvoice/saverio/ui/dashboard/DashboardFragment.kt: (312, 33): Variable 'newVoices' initializer is redundant
w: /home/vagrant/build/org.commonvoice.saverio/app/src/main/java/org/commonvoice/saverio/ui/dashboard/DashboardFragment.kt: (349, 42): Variable 'returnTrueOrFalse' initializer is redundant
w: /home/vagrant/build/org.commonvoice.saverio/app/src/main/java/org/commonvoice/saverio/ui/dashboard/DashboardFragment.kt: (388, 17): Variable 'speakOrListen' is assigned but never accessed
w: /home/vagrant/build/org.commonvoice.saverio/app/src/main/java/org/commonvoice/saverio/ui/dashboard/DashboardFragment.kt: (390, 17): The value 'false' assigned to 'var speakOrListen: Boolean defined in org.commonvoice.saverio.ui.dashboard.DashboardFragment.loadDataOf' is never used

> Task :app:javaPreCompileRelease
> Task :app:compileReleaseJavaWithJavac
> Task :app:compileReleaseSources

> Task :app:lintVitalRelease
Calling mockable JAR artifact transform to create file: /home/vagrant/.gradle/caches/transforms-2/files-2.1/69b9586e5ae98065064affee45d2e1be/android.jar with input /home/vagrant/android-sdk/platforms/android-28/android.jar
/home/vagrant/build/org.commonvoice.saverio/app/src/main/res/layout/message_dialog.xml:77: Error: @+id/btnLogout is not a sibling in the same ConstraintLayout [NotSibling]
            app:layout_constraintBottom_toTopOf="@+id/btnLogout"
            ~~~~~~~~~~~~~~~~~~~~~~~~~~~~~~~~~~~~~~~~~~~~~~~~~~~~

   Explanation for issues of type "NotSibling":
   Layout constraints in a given ConstraintLayout or RelativeLayout should
   reference other views within the same relative layout (but not itself!)

1 errors, 0 warnings

> Task :app:lintVitalRelease FAILED

FAILURE: Build failed with an exception.

* What went wrong:
Execution failed for task ':app:lintVitalRelease'.
> Lint found fatal errors while assembling a release target.
  
  To proceed, either fix the issues identified by lint, or modify your build script as follows:
  ...
  android {
      lintOptions {
          checkReleaseBuilds false
          // Or, if you prefer, you can continue to check for errors in release builds,
          // but continue the build even when errors are found:
          abortOnError false
      }
  }
  ...

* Try:
Run with --stacktrace option to get the stack trace. Run with --info or --debug option to get more log output. Run with --scan to get full insights.

* Get more help at https://help.gradle.org

Deprecated Gradle features were used in this build, making it incompatible with Gradle 6.0.
Use '--warning-mode all' to show the individual deprecation warnings.
See https://docs.gradle.org/5.4.1/userguide/command_line_interface.html#sec:command_line_warnings

BUILD FAILED in 1m 5s
14 actionable tasks: 14 executed
==== detail end ====