org.courville.nova/lastbuild 404916

From F-Droid
Jump to: navigation, search

Installed Android Tools

Build Log

'Build.py failed on server for org.courville.nova:4.49.16'

detail

[...]
ld/org.courville.nova/native/libyuv'
make[1]: Entering directory '/home/vagrant/build/org.courville.nova/native/libyuv'
[x86] Compile++      : yuv_static <= rotate_common.cc
make[1]: Leaving directory '/home/vagrant/build/org.courville.nova/native/libyuv'
make[1]: Entering directory '/home/vagrant/build/org.courville.nova/native/libyuv'
[x86] Compile++      : yuv_static <= rotate_neon64.cc
make[1]: Leaving directory '/home/vagrant/build/org.courville.nova/native/libyuv'
make[1]: Entering directory '/home/vagrant/build/org.courville.nova/native/libyuv'
[x86] Compile++      : yuv_static <= row_dspr2.cc
make[1]: Leaving directory '/home/vagrant/build/org.courville.nova/native/libyuv'
make[1]: Entering directory '/home/vagrant/build/org.courville.nova/native/libyuv'
[x86] Compile++      : yuv_static <= row_neon64.cc
make[1]: Leaving directory '/home/vagrant/build/org.courville.nova/native/libyuv'
make[1]: Entering directory '/home/vagrant/build/org.courville.nova/native/libyuv'
[x86] Compile++      : yuv_static <= scale_any.cc
make[1]: Leaving directory '/home/vagrant/build/org.courville.nova/native/libyuv'
make[1]: Entering directory '/home/vagrant/build/org.courville.nova/native/libyuv'
[x86] Compile++      : yuv_static <= row_neon.cc
make[1]: Leaving directory '/home/vagrant/build/org.courville.nova/native/libyuv'
make[1]: Entering directory '/home/vagrant/build/org.courville.nova/native/libyuv'
[x86] Compile++      : yuv_static <= scale_msa.cc
make[1]: Leaving directory '/home/vagrant/build/org.courville.nova/native/libyuv'
make[1]: Entering directory '/home/vagrant/build/org.courville.nova/native/libyuv'
[x86] Compile++      : yuv_static <= scale_dspr2.cc
make[1]: Leaving directory '/home/vagrant/build/org.courville.nova/native/libyuv'
make[1]: Entering directory '/home/vagrant/build/org.courville.nova/native/libyuv'
[x86] Compile++      : yuv_static <= row_msa.cc
make[1]: Leaving directory '/home/vagrant/build/org.courville.nova/native/libyuv'
make[1]: Entering directory '/home/vagrant/build/org.courville.nova/native/libyuv'
[x86] Install        : libc++_shared.so => libs/x86/libc++_shared.so
make[1]: Leaving directory '/home/vagrant/build/org.courville.nova/native/libyuv'
make[1]: Entering directory '/home/vagrant/build/org.courville.nova/native/libyuv'
[x86] Compile++      : yuv_static <= video_common.cc
make[1]: Leaving directory '/home/vagrant/build/org.courville.nova/native/libyuv'
make[1]: Entering directory '/home/vagrant/build/org.courville.nova/native/libyuv'
[x86] Compile++      : yuv_static <= planar_functions.cc
make[1]: Leaving directory '/home/vagrant/build/org.courville.nova/native/libyuv'
make[1]: Entering directory '/home/vagrant/build/org.courville.nova/native/libyuv'
[x86] Compile++      : yuv_static <= scale.cc
make[1]: Leaving directory '/home/vagrant/build/org.courville.nova/native/libyuv'
make[1]: Entering directory '/home/vagrant/build/org.courville.nova/native/libyuv'
[x86] Compile++      : yuv_static <= scale_argb.cc
make[1]: Leaving directory '/home/vagrant/build/org.courville.nova/native/libyuv'
make[1]: Entering directory '/home/vagrant/build/org.courville.nova/native/libyuv'
[x86] Compile++      : yuv_static <= scale_gcc.cc
make[1]: Leaving directory '/home/vagrant/build/org.courville.nova/native/libyuv'
make[1]: Entering directory '/home/vagrant/build/org.courville.nova/native/libyuv'
[x86] Compile++      : yuv_static <= scale_neon.cc
make[1]: Leaving directory '/home/vagrant/build/org.courville.nova/native/libyuv'
make[1]: Entering directory '/home/vagrant/build/org.courville.nova/native/libyuv'
[x86] Compile++      : yuv_static <= scale_neon64.cc
make[1]: Leaving directory '/home/vagrant/build/org.courville.nova/native/libyuv'
make[1]: Entering directory '/home/vagrant/build/org.courville.nova/native/libyuv'
[x86] Compile++      : yuv_static <= row_any.cc
make[1]: Leaving directory '/home/vagrant/build/org.courville.nova/native/libyuv'
make[1]: Entering directory '/home/vagrant/build/org.courville.nova/native/libyuv'
[x86] Compile++      : yuv_static <= row_gcc.cc
make[1]: Leaving directory '/home/vagrant/build/org.courville.nova/native/libyuv'
make[1]: Entering directory '/home/vagrant/build/org.courville.nova/native/libyuv'
[x86] Compile++      : yuv_static <= scale_common.cc
make[1]: Leaving directory '/home/vagrant/build/org.courville.nova/native/libyuv'
make[1]: Entering directory '/home/vagrant/build/org.courville.nova/native/libyuv'
[arm64-v8a] StaticLibrary  : libyuv_static.a
make[1]: Leaving directory '/home/vagrant/build/org.courville.nova/native/libyuv'
make[1]: Entering directory '/home/vagrant/build/org.courville.nova/native/libyuv'
[armeabi-v7a] StaticLibrary  : libyuv_static.a
make[1]: Leaving directory '/home/vagrant/build/org.courville.nova/native/libyuv'
make[1]: Entering directory '/home/vagrant/build/org.courville.nova/native/libyuv'
[x86_64] StaticLibrary  : libyuv_static.a
make[1]: Leaving directory '/home/vagrant/build/org.courville.nova/native/libyuv'
make[1]: Entering directory '/home/vagrant/build/org.courville.nova/native/libyuv'
[x86_64] SharedLibrary  : libyuv.so
make[1]: Leaving directory '/home/vagrant/build/org.courville.nova/native/libyuv'
make[1]: Entering directory '/home/vagrant/build/org.courville.nova/native/libyuv'
[x86_64] Install        : libyuv.so => libs/x86_64/libyuv.so
make[1]: Leaving directory '/home/vagrant/build/org.courville.nova/native/libyuv'
make[1]: Entering directory '/home/vagrant/build/org.courville.nova/native/libyuv'
[armeabi-v7a] SharedLibrary  : libyuv.so
make[1]: Leaving directory '/home/vagrant/build/org.courville.nova/native/libyuv'
make[1]: Entering directory '/home/vagrant/build/org.courville.nova/native/libyuv'
[armeabi-v7a] Install        : libyuv.so => libs/armeabi-v7a/libyuv.so
make[1]: Leaving directory '/home/vagrant/build/org.courville.nova/native/libyuv'
make[1]: Entering directory '/home/vagrant/build/org.courville.nova/native/libyuv'
[arm64-v8a] SharedLibrary  : libyuv.so
make[1]: Leaving directory '/home/vagrant/build/org.courville.nova/native/libyuv'
make[1]: Entering directory '/home/vagrant/build/org.courville.nova/native/libyuv'
[arm64-v8a] Install        : libyuv.so => libs/arm64-v8a/libyuv.so
make[1]: Leaving directory '/home/vagrant/build/org.courville.nova/native/libyuv'
make[1]: Entering directory '/home/vagrant/build/org.courville.nova/native/libyuv'
[x86] Compile++      : yuv_static <= row_common.cc
make[1]: Leaving directory '/home/vagrant/build/org.courville.nova/native/libyuv'
make[1]: Entering directory '/home/vagrant/build/org.courville.nova/native/libyuv'
[x86] StaticLibrary  : libyuv_static.a
make[1]: Leaving directory '/home/vagrant/build/org.courville.nova/native/libyuv'
make[1]: Entering directory '/home/vagrant/build/org.courville.nova/native/libyuv'
[x86] SharedLibrary  : libyuv.so
make[1]: Leaving directory '/home/vagrant/build/org.courville.nova/native/libyuv'
make[1]: Entering directory '/home/vagrant/build/org.courville.nova/native/libyuv'
[x86] Install        : libyuv.so => libs/x86/libyuv.so
make[1]: Leaving directory '/home/vagrant/build/org.courville.nova/native/libyuv'
make[1]: Entering directory '/home/vagrant/build/org.courville.nova/native/libnativehelper'
Android NDK: WARNING: APP_PLATFORM android-21 is higher than android:minSdkVersion 1 in ./AndroidManifest.xml. NDK binaries will *not* be compatible with devices older than android-21. See https://android.googlesource.com/platform/ndk/+/master/docs/user/common_problems.md for more information.    
make[1]: Leaving directory '/home/vagrant/build/org.courville.nova/native/libnativehelper'
make[1]: Entering directory '/home/vagrant/build/org.courville.nova/native/libnativehelper'
[arm64-v8a] Install        : libnativehelper.so => libs/arm64-v8a/libnativehelper.so
make[1]: Leaving directory '/home/vagrant/build/org.courville.nova/native/libnativehelper'
make[1]: Entering directory '/home/vagrant/build/org.courville.nova/native/libnativehelper'
[x86_64] Install        : libnativehelper.so => libs/x86_64/libnativehelper.so
make[1]: Leaving directory '/home/vagrant/build/org.courville.nova/native/libnativehelper'
make[1]: Entering directory '/home/vagrant/build/org.courville.nova/native/libnativehelper'
[armeabi-v7a] Install        : libnativehelper.so => libs/armeabi-v7a/libnativehelper.so
make[1]: Leaving directory '/home/vagrant/build/org.courville.nova/native/libnativehelper'
make[1]: Entering directory '/home/vagrant/build/org.courville.nova/native/libnativehelper'
[arm64-v8a] Install        : libc++_shared.so => libs/arm64-v8a/libc++_shared.so
make[1]: Leaving directory '/home/vagrant/build/org.courville.nova/native/libnativehelper'
make[1]: Entering directory '/home/vagrant/build/org.courville.nova/native/libnativehelper'
[x86] Install        : libnativehelper.so => libs/x86/libnativehelper.so
make[1]: Leaving directory '/home/vagrant/build/org.courville.nova/native/libnativehelper'
make[1]: Entering directory '/home/vagrant/build/org.courville.nova/native/libnativehelper'
[x86_64] Install        : libc++_shared.so => libs/x86_64/libc++_shared.so
make[1]: Leaving directory '/home/vagrant/build/org.courville.nova/native/libnativehelper'
make[1]: Entering directory '/home/vagrant/build/org.courville.nova/native/libnativehelper'
[armeabi-v7a] Install        : libc++_shared.so => libs/armeabi-v7a/libc++_shared.so
make[1]: Leaving directory '/home/vagrant/build/org.courville.nova/native/libnativehelper'
make[1]: Entering directory '/home/vagrant/build/org.courville.nova/native/libnativehelper'
[x86] Install        : libc++_shared.so => libs/x86/libc++_shared.so
make[1]: Leaving directory '/home/vagrant/build/org.courville.nova/native/libnativehelper'
cd native/dav1d-android-builder; android_ndk=/home/vagrant/android-ndk/r21d REPO_TOP_DIR=/home/vagrant/build/org.courville.nova bash bootstrap_avp_dav1d.sh
Warning: File /home/vagrant/.android/repositories.cfg could not be loaded.
done
ls: cannot access '/home/vagrant/android-sdk/ndk/*': No such file or directory
NDK_PATH is
Generating toolchain description...
Cloning into 'dav1d'...
warning: redirecting to https://code.videolan.org/videolan/dav1d.git/
Note: checking out '6ed5fafb42c651c24b6a65fd4f50ed426fd72d65'.

You are in 'detached HEAD' state. You can look around, make experimental
changes and commit them, and you can discard any commits you make in this
state without impacting any branches by performing another checkout.

If you want to create a new branch to retain commits you create, you may
do so (now or later) by using -b with the checkout command again. Example:

  git checkout -b <new-branch-name>

Build: calling meson...
The Meson build system
Version: 0.53.2
Source dir: /home/vagrant/build/org.courville.nova/native/dav1d-android-builder/dav1d
Build dir: /home/vagrant/build/org.courville.nova/native/dav1d-android-builder/build-armeabi-v7a
Build type: cross build
Project name: dav1d
Project version: 0.8.1
C compiler for the build machine: cc (gcc 6.3.0 "cc (Debian 6.3.0-18+deb9u1) 6.3.0 20170516")
C linker for the build machine: cc ld.bfd 2.28

meson.build:25:0: ERROR: Unknown compiler(s): [['/toolchains/llvm/prebuilt/linux-x86_64/bin/armv7a-linux-androideabi21-clang']]
The follow exceptions were encountered:
Running "/toolchains/llvm/prebuilt/linux-x86_64/bin/armv7a-linux-androideabi21-clang --version" gave "[Errno 2] No such file or directory: '/toolchains/llvm/prebuilt/linux-x86_64/bin/armv7a-linux-androideabi21-clang'"

A full log can be found at /home/vagrant/build/org.courville.nova/native/dav1d-android-builder/build-armeabi-v7a/meson-logs/meson-log.txt
Warning: File /home/vagrant/.android/repositories.cfg could not be loaded.
done
ls: cannot access '/home/vagrant/android-sdk/ndk/*': No such file or directory
NDK_PATH is
Generating toolchain description...
Build: calling meson...
The Meson build system
Version: 0.53.2
Source dir: /home/vagrant/build/org.courville.nova/native/dav1d-android-builder/dav1d
Build dir: /home/vagrant/build/org.courville.nova/native/dav1d-android-builder/build-arm64-v8a
Build type: cross build
Project name: dav1d
Project version: 0.8.1
C compiler for the build machine: cc (gcc 6.3.0 "cc (Debian 6.3.0-18+deb9u1) 6.3.0 20170516")
C linker for the build machine: cc ld.bfd 2.28

meson.build:25:0: ERROR: Unknown compiler(s): [['/toolchains/llvm/prebuilt/linux-x86_64/bin/aarch64-linux-android21-clang']]
The follow exceptions were encountered:
Running "/toolchains/llvm/prebuilt/linux-x86_64/bin/aarch64-linux-android21-clang --version" gave "[Errno 2] No such file or directory: '/toolchains/llvm/prebuilt/linux-x86_64/bin/aarch64-linux-android21-clang'"

A full log can be found at /home/vagrant/build/org.courville.nova/native/dav1d-android-builder/build-arm64-v8a/meson-logs/meson-log.txt
Warning: File /home/vagrant/.android/repositories.cfg could not be loaded.
done
ls: cannot access '/home/vagrant/android-sdk/ndk/*': No such file or directory
NDK_PATH is
Generating toolchain description...
Build: calling meson...
The Meson build system
Version: 0.53.2
Source dir: /home/vagrant/build/org.courville.nova/native/dav1d-android-builder/dav1d
Build dir: /home/vagrant/build/org.courville.nova/native/dav1d-android-builder/build-x86
Build type: cross build
Project name: dav1d
Project version: 0.8.1
C compiler for the build machine: cc (gcc 6.3.0 "cc (Debian 6.3.0-18+deb9u1) 6.3.0 20170516")
C linker for the build machine: cc ld.bfd 2.28

meson.build:25:0: ERROR: Unknown compiler(s): [['/toolchains/llvm/prebuilt/linux-x86_64/bin/i686-linux-android21-clang']]
The follow exceptions were encountered:
Running "/toolchains/llvm/prebuilt/linux-x86_64/bin/i686-linux-android21-clang --version" gave "[Errno 2] No such file or directory: '/toolchains/llvm/prebuilt/linux-x86_64/bin/i686-linux-android21-clang'"

A full log can be found at /home/vagrant/build/org.courville.nova/native/dav1d-android-builder/build-x86/meson-logs/meson-log.txt
Warning: File /home/vagrant/.android/repositories.cfg could not be loaded.
done
ls: cannot access '/home/vagrant/android-sdk/ndk/*': No such file or directory
NDK_PATH is
Generating toolchain description...
Build: calling meson...
The Meson build system
Version: 0.53.2
Source dir: /home/vagrant/build/org.courville.nova/native/dav1d-android-builder/dav1d
Build dir: /home/vagrant/build/org.courville.nova/native/dav1d-android-builder/build-x86_64
Build type: cross build
Project name: dav1d
Project version: 0.8.1
C compiler for the build machine: cc (gcc 6.3.0 "cc (Debian 6.3.0-18+deb9u1) 6.3.0 20170516")
C linker for the build machine: cc ld.bfd 2.28

meson.build:25:0: ERROR: Unknown compiler(s): [['/toolchains/llvm/prebuilt/linux-x86_64/bin/x86_64-linux-android21-clang']]
The follow exceptions were encountered:
Running "/toolchains/llvm/prebuilt/linux-x86_64/bin/x86_64-linux-android21-clang --version" gave "[Errno 2] No such file or directory: '/toolchains/llvm/prebuilt/linux-x86_64/bin/x86_64-linux-android21-clang'"

A full log can be found at /home/vagrant/build/org.courville.nova/native/dav1d-android-builder/build-x86_64/meson-logs/meson-log.txt
make: *** [native_build_native/dav1d-android-builder] Error 1
AVP/core.mk:274: recipe for target 'native_build_native/dav1d-android-builder' failed

> Task :MediaLib:ndkBuild FAILED

FAILURE: Build failed with an exception.

* What went wrong:
Execution failed for task ':MediaLib:ndkBuild'.
> Process 'command 'make'' finished with non-zero exit value 2

* Try:
Run with --stacktrace option to get the stack trace. Run with --info or --debug option to get more log output. Run with --scan to get full insights.

* Get more help at https://help.gradle.org

BUILD FAILED in 1m 30s
3 actionable tasks: 3 executed
==== detail end ====