ru.yanus171.feedexfork/lastbuild 223

From F-Droid
Jump to: navigation, search

Installed Android Tools

Build Log

'Build.py failed on server for ru.yanus171.feedexfork:0.15.13'

detail

== Installed Android Tools ==

2020-10-31 09:08:51,451 INFO: Creating log directory
2020-10-31 09:08:51,451 INFO: Creating temporary directory
2020-10-31 09:08:51,451 INFO: Creating output directory
2020-10-31 09:08:54,000 INFO: Using git version 2.11.0
2020-10-31 09:08:54,001 INFO: Building version 0.15.13 (223) of ru.yanus171.feedexfork
2020-10-31 09:08:57,485 INFO: Getting source for revision v0.15.13
2020-10-31 09:08:59,859 INFO: Creating local.properties file at build/ru.yanus171.feedexfork/local.properties
2020-10-31 09:08:59,860 INFO: Creating local.properties file at build/ru.yanus171.feedexfork/FlymFork/local.properties
2020-10-31 09:08:59,867 INFO: Cleaned build.gradle of keysigning configs at build/ru.yanus171.feedexfork/FlymFork/build.gradle
2020-10-31 09:08:59,878 INFO: Cleaning Gradle project...
2020-10-31 09:09:15,917 INFO: Scanning source for common problems...
2020-10-31 09:09:15,923 INFO: Removing gradle-wrapper.jar at gradle/wrapper/gradle-wrapper.jar
2020-10-31 09:09:15,955 INFO: Creating source tarball...
2020-10-31 09:09:16,527 INFO: Building Gradle project...
2020-10-31 09:09:44,441 ERROR: Could not build app ru.yanus171.feedexfork: Build failed for ru.yanus171.feedexfork:0.15.13
==== detail begin ====
Found 6.1.1 via distributionUrl
Running /opt/gradle/versions/6.1.1/bin/gradle assembleRelease
To honour the JVM settings for this build a new JVM will be forked. Please consider using the daemon: https://docs.gradle.org/6.1.1/userguide/gradle_daemon.html.
Daemon will be stopped at the end of the build stopping after processing
> Task :FlymFork:preBuild UP-TO-DATE
> Task :FlymFork:preReleaseBuild UP-TO-DATE
> Task :FlymFork:compileReleaseAidl NO-SOURCE
> Task :FlymFork:generateReleaseBuildConfig
> Task :FlymFork:compileReleaseRenderscript NO-SOURCE
> Task :FlymFork:generateReleaseResValues
> Task :FlymFork:generateReleaseResources
/home/vagrant/build/ru.yanus171.feedexfork/FlymFork/build/intermediates/incremental/mergeReleaseResources/merged.dir/values-el/values-el.xml:86: warn: multiple substitutions specified in non-positional format; did you mean to add the formatted="false" attribute?.

/home/vagrant/build/ru.yanus171.feedexfork/FlymFork/build/intermediates/incremental/mergeReleaseResources/merged.dir/values-id/values-id.xml:56: warn: multiple substitutions specified in non-positional format; did you mean to add the formatted="false" attribute?.

/home/vagrant/build/ru.yanus171.feedexfork/FlymFork/build/intermediates/incremental/mergeReleaseResources/merged.dir/values-pt/values-pt.xml:86: warn: multiple substitutions specified in non-positional format; did you mean to add the formatted="false" attribute?.

/home/vagrant/build/ru.yanus171.feedexfork/FlymFork/build/intermediates/incremental/mergeReleaseResources/merged.dir/values-fr/values-fr.xml:86: warn: multiple substitutions specified in non-positional format; did you mean to add the formatted="false" attribute?.

/home/vagrant/build/ru.yanus171.feedexfork/FlymFork/build/intermediates/incremental/mergeReleaseResources/merged.dir/values-ar/values-ar.xml:90: warn: multiple substitutions specified in non-positional format; did you mean to add the formatted="false" attribute?.

/home/vagrant/build/ru.yanus171.feedexfork/FlymFork/build/intermediates/incremental/mergeReleaseResources/merged.dir/values-zh/values-zh.xml:48: warn: multiple substitutions specified in non-positional format; did you mean to add the formatted="false" attribute?.

/home/vagrant/build/ru.yanus171.feedexfork/FlymFork/build/intermediates/incremental/mergeReleaseResources/merged.dir/values-ru/values-ru.xml:88: warn: multiple substitutions specified in non-positional format; did you mean to add the formatted="false" attribute?.

/home/vagrant/build/ru.yanus171.feedexfork/FlymFork/build/intermediates/incremental/mergeReleaseResources/merged.dir/values-eu/values-eu.xml:79: warn: multiple substitutions specified in non-positional format; did you mean to add the formatted="false" attribute?.

/home/vagrant/build/ru.yanus171.feedexfork/FlymFork/build/intermediates/incremental/mergeReleaseResources/merged.dir/values-it/values-it.xml:86: warn: multiple substitutions specified in non-positional format; did you mean to add the formatted="false" attribute?.

> Task :FlymFork:createReleaseCompatibleScreenManifests
> Task :FlymFork:extractDeepLinksRelease
/home/vagrant/build/ru.yanus171.feedexfork/FlymFork/build/intermediates/incremental/mergeReleaseResources/merged.dir/values/values.xml:924: warn: multiple substitutions specified in non-positional format; did you mean to add the formatted="false" attribute?.

/home/vagrant/build/ru.yanus171.feedexfork/FlymFork/build/intermediates/incremental/mergeReleaseResources/merged.dir/values-pl/values-pl.xml:88: warn: multiple substitutions specified in non-positional format; did you mean to add the formatted="false" attribute?.

/home/vagrant/build/ru.yanus171.feedexfork/FlymFork/build/intermediates/incremental/mergeReleaseResources/merged.dir/values-de/values-de.xml:86: warn: multiple substitutions specified in non-positional format; did you mean to add the formatted="false" attribute?.

> Task :FlymFork:processReleaseManifest
> Task :FlymFork:mergeReleaseResources
warn: removing resource ru.yanus171.feedexfork:string/about_flym without required default value.
warn: removing resource ru.yanus171.feedexfork:string/menu_all_read without required default value.
warn: removing resource ru.yanus171.feedexfork:string/settings_display_entries_fullscreen_description without required default value.
warn: removing resource ru.yanus171.feedexfork:string/settings_light_theme without required default value.
warn: removing resource ru.yanus171.feedexfork:string/settings_light_theme_description without required default value.
warn: removing resource ru.yanus171.feedexfork:string/settings_refresh_enabled_description without required default value.

> Task :FlymFork:processReleaseResources

> Task :FlymFork:compileReleaseKotlin FAILED
e: /home/vagrant/build/ru.yanus171.feedexfork/FlymFork/src/main/java/ru/yanus171/feedexfork/parser/HTMLParser.kt: (99, 9): 'run(T.() -> R): R' is only available since Kotlin 1.3.50 and cannot be used in Kotlin 1.3
e: /home/vagrant/build/ru.yanus171.feedexfork/FlymFork/src/main/java/ru/yanus171/feedexfork/parser/HTMLParser.kt: (130, 9): 'run(T.() -> R): R' is only available since Kotlin 1.3.50 and cannot be used in Kotlin 1.3
e: /home/vagrant/build/ru.yanus171.feedexfork/FlymFork/src/main/java/ru/yanus171/feedexfork/parser/HTMLParser.kt: (154, 9): 'run(T.() -> R): R' is only available since Kotlin 1.3.50 and cannot be used in Kotlin 1.3
e: /home/vagrant/build/ru.yanus171.feedexfork/FlymFork/src/main/java/ru/yanus171/feedexfork/parser/HTMLParser.kt: (182, 17): 'synchronized(Any, () -> R): R' is only available since Kotlin 1.3.50 and cannot be used in Kotlin 1.3
e: /home/vagrant/build/ru.yanus171.feedexfork/FlymFork/src/main/java/ru/yanus171/feedexfork/parser/HTMLParser.kt: (200, 45): 'synchronized(Any, () -> R): R' is only available since Kotlin 1.3.50 and cannot be used in Kotlin 1.3
e: /home/vagrant/build/ru.yanus171.feedexfork/FlymFork/src/main/java/ru/yanus171/feedexfork/parser/HTMLParser.kt: (235, 9): 'run(T.() -> R): R' is only available since Kotlin 1.3.50 and cannot be used in Kotlin 1.3
e: /home/vagrant/build/ru.yanus171.feedexfork/FlymFork/src/main/java/ru/yanus171/feedexfork/parser/HTMLParser.kt: (240, 9): 'run(T.() -> R): R' is only available since Kotlin 1.3.50 and cannot be used in Kotlin 1.3
e: /home/vagrant/build/ru.yanus171.feedexfork/FlymFork/src/main/java/ru/yanus171/feedexfork/parser/OneWebPageParser.kt: (122, 33): 'synchronized(Any, () -> R): R' is only available since Kotlin 1.3.50 and cannot be used in Kotlin 1.3
e: /home/vagrant/build/ru.yanus171.feedexfork/FlymFork/src/main/java/ru/yanus171/feedexfork/utils/EntryUrlVoc.kt: (22, 9): 'synchronized(Any, () -> R): R' is only available since Kotlin 1.3.50 and cannot be used in Kotlin 1.3
e: /home/vagrant/build/ru.yanus171.feedexfork/FlymFork/src/main/java/ru/yanus171/feedexfork/utils/EntryUrlVoc.kt: (28, 9): 'synchronized(Any, () -> R): R' is only available since Kotlin 1.3.50 and cannot be used in Kotlin 1.3
e: /home/vagrant/build/ru.yanus171.feedexfork/FlymFork/src/main/java/ru/yanus171/feedexfork/utils/EntryUrlVoc.kt: (34, 9): 'synchronized(Any, () -> R): R' is only available since Kotlin 1.3.50 and cannot be used in Kotlin 1.3
e: /home/vagrant/build/ru.yanus171.feedexfork/FlymFork/src/main/java/ru/yanus171/feedexfork/utils/EntryUrlVoc.kt: (43, 9): 'synchronized(Any, () -> R): R' is only available since Kotlin 1.3.50 and cannot be used in Kotlin 1.3
e: /home/vagrant/build/ru.yanus171.feedexfork/FlymFork/src/main/java/ru/yanus171/feedexfork/utils/EntryUrlVoc.kt: (48, 13): 'synchronized(Any, () -> R): R' is only available since Kotlin 1.3.50 and cannot be used in Kotlin 1.3
e: /home/vagrant/build/ru.yanus171.feedexfork/FlymFork/src/main/java/ru/yanus171/feedexfork/utils/EntryUrlVoc.kt: (68, 9): 'synchronized(Any, () -> R): R' is only available since Kotlin 1.3.50 and cannot be used in Kotlin 1.3
e: /home/vagrant/build/ru.yanus171.feedexfork/FlymFork/src/main/java/ru/yanus171/feedexfork/utils/FileUtils.kt: (60, 73): 'trim((Char) -> Boolean): String' is only available since Kotlin 1.3.50 and cannot be used in Kotlin 1.3
e: /home/vagrant/build/ru.yanus171.feedexfork/FlymFork/src/main/java/ru/yanus171/feedexfork/utils/FileUtils.kt: (154, 21): 'use((T) -> R): R' is only available since Kotlin 1.3.50 and cannot be used in Kotlin 1.3
e: /home/vagrant/build/ru.yanus171.feedexfork/FlymFork/src/main/java/ru/yanus171/feedexfork/utils/FileUtils.kt: (235, 9): 'with(T, T.() -> R): R' is only available since Kotlin 1.3.50 and cannot be used in Kotlin 1.3
e: /home/vagrant/build/ru.yanus171.feedexfork/FlymFork/src/main/java/ru/yanus171/feedexfork/utils/FileVoc.kt: (24, 9): 'synchronized(Any, () -> R): R' is only available since Kotlin 1.3.50 and cannot be used in Kotlin 1.3
e: /home/vagrant/build/ru.yanus171.feedexfork/FlymFork/src/main/java/ru/yanus171/feedexfork/utils/FileVoc.kt: (30, 9): 'synchronized(Any, () -> R): R' is only available since Kotlin 1.3.50 and cannot be used in Kotlin 1.3
e: /home/vagrant/build/ru.yanus171.feedexfork/FlymFork/src/main/java/ru/yanus171/feedexfork/utils/FileVoc.kt: (44, 9): 'synchronized(Any, () -> R): R' is only available since Kotlin 1.3.50 and cannot be used in Kotlin 1.3
e: /home/vagrant/build/ru.yanus171.feedexfork/FlymFork/src/main/java/ru/yanus171/feedexfork/utils/FileVoc.kt: (50, 9): 'synchronized(Any, () -> R): R' is only available since Kotlin 1.3.50 and cannot be used in Kotlin 1.3
e: /home/vagrant/build/ru.yanus171.feedexfork/FlymFork/src/main/java/ru/yanus171/feedexfork/utils/FileVoc.kt: (56, 9): 'synchronized(Any, () -> R): R' is only available since Kotlin 1.3.50 and cannot be used in Kotlin 1.3
e: /home/vagrant/build/ru.yanus171.feedexfork/FlymFork/src/main/java/ru/yanus171/feedexfork/utils/FileVoc.kt: (66, 13): 'synchronized(Any, () -> R): R' is only available since Kotlin 1.3.50 and cannot be used in Kotlin 1.3
e: /home/vagrant/build/ru.yanus171.feedexfork/FlymFork/src/main/java/ru/yanus171/feedexfork/utils/FileVoc.kt: (73, 13): 'synchronized(Any, () -> R): R' is only available since Kotlin 1.3.50 and cannot be used in Kotlin 1.3

> Task :FlymFork:javaPreCompileRelease

FAILURE: Build failed with an exception.

* What went wrong:
Execution failed for task ':FlymFork:compileReleaseKotlin'.
> Compilation error. See log for more details

* Try:
Run with --stacktrace option to get the stack trace. Run with --info or --debug option to get more log output. Run with --scan to get full insights.

* Get more help at https://help.gradle.org

BUILD FAILED in 27s
9 actionable tasks: 9 executed
==== detail end ====