se.leap.bitmaskclient/lastbuild 140

From F-Droid
Jump to: navigation, search

Installed Android Tools

Build Log

'Build.py failed on server for se.leap.bitmaskclient:1.0.0'

detail

[...]
uildevents.BuildExceptionReporter] 	at org.gradle.tooling.internal.provider.SessionFailureReportingActionExecuter.execute(SessionFailureReportingActionExecuter.java:59)
19:10:24.235 [ERROR] [org.gradle.internal.buildevents.BuildExceptionReporter] 	at org.gradle.tooling.internal.provider.SessionFailureReportingActionExecuter.execute(SessionFailureReportingActionExecuter.java:44)
19:10:24.235 [ERROR] [org.gradle.internal.buildevents.BuildExceptionReporter] 	at org.gradle.tooling.internal.provider.SetupLoggingActionExecuter.execute(SetupLoggingActionExecuter.java:45)
19:10:24.235 [ERROR] [org.gradle.internal.buildevents.BuildExceptionReporter] 	at org.gradle.tooling.internal.provider.SetupLoggingActionExecuter.execute(SetupLoggingActionExecuter.java:30)
19:10:24.235 [ERROR] [org.gradle.internal.buildevents.BuildExceptionReporter] 	at org.gradle.launcher.daemon.server.exec.ExecuteBuild.doBuild(ExecuteBuild.java:67)
19:10:24.235 [ERROR] [org.gradle.internal.buildevents.BuildExceptionReporter] 	at org.gradle.launcher.daemon.server.exec.BuildCommandOnly.execute(BuildCommandOnly.java:36)
19:10:24.235 [ERROR] [org.gradle.internal.buildevents.BuildExceptionReporter] 	at org.gradle.launcher.daemon.server.api.DaemonCommandExecution.proceed(DaemonCommandExecution.java:122)
19:10:24.235 [ERROR] [org.gradle.internal.buildevents.BuildExceptionReporter] 	at org.gradle.launcher.daemon.server.exec.WatchForDisconnection.execute(WatchForDisconnection.java:37)
19:10:24.236 [ERROR] [org.gradle.internal.buildevents.BuildExceptionReporter] 	at org.gradle.launcher.daemon.server.api.DaemonCommandExecution.proceed(DaemonCommandExecution.java:122)
19:10:24.236 [ERROR] [org.gradle.internal.buildevents.BuildExceptionReporter] 	at org.gradle.launcher.daemon.server.exec.ResetDeprecationLogger.execute(ResetDeprecationLogger.java:26)
19:10:24.236 [ERROR] [org.gradle.internal.buildevents.BuildExceptionReporter] 	at org.gradle.launcher.daemon.server.api.DaemonCommandExecution.proceed(DaemonCommandExecution.java:122)
19:10:24.236 [ERROR] [org.gradle.internal.buildevents.BuildExceptionReporter] 	at org.gradle.launcher.daemon.server.exec.RequestStopIfSingleUsedDaemon.execute(RequestStopIfSingleUsedDaemon.java:34)
19:10:24.236 [ERROR] [org.gradle.internal.buildevents.BuildExceptionReporter] 	at org.gradle.launcher.daemon.server.api.DaemonCommandExecution.proceed(DaemonCommandExecution.java:122)
19:10:24.236 [ERROR] [org.gradle.internal.buildevents.BuildExceptionReporter] 	at org.gradle.launcher.daemon.server.exec.ForwardClientInput$2.call(ForwardClientInput.java:74)
19:10:24.236 [ERROR] [org.gradle.internal.buildevents.BuildExceptionReporter] 	at org.gradle.launcher.daemon.server.exec.ForwardClientInput$2.call(ForwardClientInput.java:72)
19:10:24.236 [ERROR] [org.gradle.internal.buildevents.BuildExceptionReporter] 	at org.gradle.util.Swapper.swap(Swapper.java:38)
19:10:24.236 [ERROR] [org.gradle.internal.buildevents.BuildExceptionReporter] 	at org.gradle.launcher.daemon.server.exec.ForwardClientInput.execute(ForwardClientInput.java:72)
19:10:24.236 [ERROR] [org.gradle.internal.buildevents.BuildExceptionReporter] 	at org.gradle.launcher.daemon.server.api.DaemonCommandExecution.proceed(DaemonCommandExecution.java:122)
19:10:24.236 [ERROR] [org.gradle.internal.buildevents.BuildExceptionReporter] 	at org.gradle.launcher.daemon.server.exec.LogAndCheckHealth.execute(LogAndCheckHealth.java:55)
19:10:24.237 [ERROR] [org.gradle.internal.buildevents.BuildExceptionReporter] 	at org.gradle.launcher.daemon.server.api.DaemonCommandExecution.proceed(DaemonCommandExecution.java:122)
19:10:24.237 [ERROR] [org.gradle.internal.buildevents.BuildExceptionReporter] 	at org.gradle.launcher.daemon.server.exec.LogToClient.doBuild(LogToClient.java:62)
19:10:24.237 [ERROR] [org.gradle.internal.buildevents.BuildExceptionReporter] 	at org.gradle.launcher.daemon.server.exec.BuildCommandOnly.execute(BuildCommandOnly.java:36)
19:10:24.237 [ERROR] [org.gradle.internal.buildevents.BuildExceptionReporter] 	at org.gradle.launcher.daemon.server.api.DaemonCommandExecution.proceed(DaemonCommandExecution.java:122)
19:10:24.237 [ERROR] [org.gradle.internal.buildevents.BuildExceptionReporter] 	at org.gradle.launcher.daemon.server.exec.EstablishBuildEnvironment.doBuild(EstablishBuildEnvironment.java:82)
19:10:24.237 [ERROR] [org.gradle.internal.buildevents.BuildExceptionReporter] 	at org.gradle.launcher.daemon.server.exec.BuildCommandOnly.execute(BuildCommandOnly.java:36)
19:10:24.237 [ERROR] [org.gradle.internal.buildevents.BuildExceptionReporter] 	at org.gradle.launcher.daemon.server.api.DaemonCommandExecution.proceed(DaemonCommandExecution.java:122)
19:10:24.237 [ERROR] [org.gradle.internal.buildevents.BuildExceptionReporter] 	at org.gradle.launcher.daemon.server.exec.StartBuildOrRespondWithBusy$1.run(StartBuildOrRespondWithBusy.java:50)
19:10:24.237 [ERROR] [org.gradle.internal.buildevents.BuildExceptionReporter] 	at org.gradle.launcher.daemon.server.DaemonStateCoordinator$1.run(DaemonStateCoordinator.java:295)
19:10:24.237 [ERROR] [org.gradle.internal.buildevents.BuildExceptionReporter] 	at org.gradle.internal.concurrent.ExecutorPolicy$CatchAndRecordFailures.onExecute(ExecutorPolicy.java:63)
19:10:24.237 [ERROR] [org.gradle.internal.buildevents.BuildExceptionReporter] 	at org.gradle.internal.concurrent.ManagedExecutorImpl$1.run(ManagedExecutorImpl.java:46)
19:10:24.237 [ERROR] [org.gradle.internal.buildevents.BuildExceptionReporter] 	at org.gradle.internal.concurrent.ThreadFactoryImpl$ManagedThreadRunnable.run(ThreadFactoryImpl.java:55)
19:10:24.237 [ERROR] [org.gradle.internal.buildevents.BuildExceptionReporter] Caused by: org.gradle.api.internal.plugins.PluginApplicationException: Failed to apply plugin [id 'com.android.application']
19:10:24.238 [ERROR] [org.gradle.internal.buildevents.BuildExceptionReporter] 	at org.gradle.api.internal.plugins.DefaultPluginManager.doApply(DefaultPluginManager.java:150)
19:10:24.238 [ERROR] [org.gradle.internal.buildevents.BuildExceptionReporter] 	at org.gradle.api.internal.plugins.DefaultPluginManager.apply(DefaultPluginManager.java:117)
19:10:24.238 [ERROR] [org.gradle.internal.buildevents.BuildExceptionReporter] 	at org.gradle.plugin.use.internal.DefaultPluginRequestApplicator$4.run(DefaultPluginRequestApplicator.java:162)
19:10:24.238 [ERROR] [org.gradle.internal.buildevents.BuildExceptionReporter] 	at org.gradle.plugin.use.internal.DefaultPluginRequestApplicator.applyPlugin(DefaultPluginRequestApplicator.java:225)
19:10:24.238 [ERROR] [org.gradle.internal.buildevents.BuildExceptionReporter] 	... 104 more
19:10:24.238 [ERROR] [org.gradle.internal.buildevents.BuildExceptionReporter] Caused by: java.lang.RuntimeException: Minimum supported Gradle version is 4.10.1. Current version is 4.6. If using the gradle wrapper, try editing the distributionUrl in /home/vagrant/build/se.leap.bitmaskclient/ics-openvpn/gradle/wrapper/gradle-wrapper.properties to gradle-4.10.1-all.zip
19:10:24.238 [ERROR] [org.gradle.internal.buildevents.BuildExceptionReporter] 	at com.android.build.gradle.BasePlugin.checkGradleVersion(BasePlugin.java:683)
19:10:24.238 [ERROR] [org.gradle.internal.buildevents.BuildExceptionReporter] 	at com.android.build.gradle.BasePlugin.basePluginApply(BasePlugin.java:258)
19:10:24.238 [ERROR] [org.gradle.internal.buildevents.BuildExceptionReporter] 	at com.android.build.gradle.BasePlugin.lambda$apply$0(BasePlugin.java:247)
19:10:24.238 [ERROR] [org.gradle.internal.buildevents.BuildExceptionReporter] 	at com.android.build.gradle.internal.crash.CrashReporting.runAction(crash_reporting.kt:27)
19:10:24.238 [ERROR] [org.gradle.internal.buildevents.BuildExceptionReporter] 	at com.android.build.gradle.BasePlugin.apply(BasePlugin.java:245)
19:10:24.239 [ERROR] [org.gradle.internal.buildevents.BuildExceptionReporter] 	at com.android.build.gradle.BasePlugin.apply(BasePlugin.java:138)
19:10:24.239 [ERROR] [org.gradle.internal.buildevents.BuildExceptionReporter] 	at org.gradle.api.internal.plugins.ImperativeOnlyPluginTarget.applyImperative(ImperativeOnlyPluginTarget.java:42)
19:10:24.239 [ERROR] [org.gradle.internal.buildevents.BuildExceptionReporter] 	at org.gradle.api.internal.plugins.RuleBasedPluginTarget.applyImperative(RuleBasedPluginTarget.java:50)
19:10:24.239 [ERROR] [org.gradle.internal.buildevents.BuildExceptionReporter] 	at org.gradle.api.internal.plugins.DefaultPluginManager.addPlugin(DefaultPluginManager.java:164)
19:10:24.239 [ERROR] [org.gradle.internal.buildevents.BuildExceptionReporter] 	at org.gradle.api.internal.plugins.DefaultPluginManager.access$200(DefaultPluginManager.java:47)
19:10:24.239 [ERROR] [org.gradle.internal.buildevents.BuildExceptionReporter] 	at org.gradle.api.internal.plugins.DefaultPluginManager$AddPluginBuildOperation.run(DefaultPluginManager.java:252)
19:10:24.239 [ERROR] [org.gradle.internal.buildevents.BuildExceptionReporter] 	at org.gradle.internal.progress.DefaultBuildOperationExecutor$RunnableBuildOperationWorker.execute(DefaultBuildOperationExecutor.java:336)
19:10:24.239 [ERROR] [org.gradle.internal.buildevents.BuildExceptionReporter] 	at org.gradle.internal.progress.DefaultBuildOperationExecutor$RunnableBuildOperationWorker.execute(DefaultBuildOperationExecutor.java:328)
19:10:24.239 [ERROR] [org.gradle.internal.buildevents.BuildExceptionReporter] 	at org.gradle.internal.progress.DefaultBuildOperationExecutor.execute(DefaultBuildOperationExecutor.java:199)
19:10:24.239 [ERROR] [org.gradle.internal.buildevents.BuildExceptionReporter] 	at org.gradle.internal.progress.DefaultBuildOperationExecutor.run(DefaultBuildOperationExecutor.java:110)
19:10:24.239 [ERROR] [org.gradle.internal.buildevents.BuildExceptionReporter] 	at org.gradle.api.internal.plugins.DefaultPluginManager.doApply(DefaultPluginManager.java:144)
19:10:24.240 [ERROR] [org.gradle.internal.buildevents.BuildExceptionReporter] 	... 107 more
19:10:24.240 [ERROR] [org.gradle.internal.buildevents.BuildExceptionReporter] 
19:10:24.240 [ERROR] [org.gradle.internal.buildevents.BuildExceptionReporter] 
19:10:24.240 [ERROR] [org.gradle.internal.buildevents.BuildExceptionReporter] * Get more help at https://help.gradle.org
19:10:24.240 [ERROR] [org.gradle.internal.buildevents.BuildResultLogger] 
19:10:24.241 [ERROR] [org.gradle.internal.buildevents.BuildResultLogger] BUILD FAILED in 1m 45s
19:10:24.254 [DEBUG] [org.gradle.internal.work.DefaultWorkerLeaseService] Worker lease root.1 completed (0 worker(s) in use)
19:10:24.255 [DEBUG] [org.gradle.internal.resources.AbstractTrackedResourceLock] Daemon worker: released lock on root.1
19:10:24.255 [DEBUG] [org.gradle.internal.progress.DefaultBuildOperationExecutor] Completing Build operation 'Run build'
19:10:24.274 [DEBUG] [org.gradle.api.internal.artifacts.ivyservice.resolveengine.store.CachedStoreFactory] Resolution result cache closed. Cache reads: 0, disk reads: 0 (avg: 0.0 secs, total: 0.0 secs)
19:10:24.275 [DEBUG] [org.gradle.api.internal.artifacts.ivyservice.resolveengine.store.CachedStoreFactory] Resolution result cache closed. Cache reads: 0, disk reads: 0 (avg: 0.0 secs, total: 0.0 secs)
19:10:24.276 [DEBUG] [org.gradle.api.internal.artifacts.ivyservice.resolveengine.store.ResolutionResultsStoreFactory] Deleted 2 resolution results binary files in 0.007 secs
19:10:24.277 [DEBUG] [org.gradle.deployment.internal.DefaultDeploymentRegistry] Stopping 0 deployment handles
19:10:24.277 [DEBUG] [org.gradle.deployment.internal.DefaultDeploymentRegistry] Stopped deployment handles
19:10:24.278 [DEBUG] [org.gradle.cache.internal.DefaultCacheAccess] Cache VCS Checkout Cache (/home/vagrant/build/se.leap.bitmaskclient/ics-openvpn/.gradle/vcsWorkingDirs) was closed 0 times.
19:10:24.457 [DEBUG] [org.gradle.cache.internal.LockOnDemandCrossProcessCacheAccess] Releasing file lock for Artifact transforms cache (/home/vagrant/.gradle/caches/transforms-1)
19:10:24.457 [DEBUG] [org.gradle.cache.internal.DefaultFileLockManager] Releasing lock on Artifact transforms cache (/home/vagrant/.gradle/caches/transforms-1).
19:10:24.458 [DEBUG] [org.gradle.cache.internal.LockOnDemandCrossProcessCacheAccess] Releasing file lock for Generated Gradle JARs cache (/home/vagrant/.gradle/caches/4.6/generated-gradle-jars)
19:10:24.458 [DEBUG] [org.gradle.cache.internal.DefaultFileLockManager] Releasing lock on Generated Gradle JARs cache (/home/vagrant/.gradle/caches/4.6/generated-gradle-jars).
19:10:24.465 [DEBUG] [org.gradle.cache.internal.LockOnDemandCrossProcessCacheAccess] Releasing file lock for file hash cache (/home/vagrant/build/se.leap.bitmaskclient/ics-openvpn/.gradle/4.6/fileHashes)
19:10:24.466 [DEBUG] [org.gradle.cache.internal.DefaultFileLockManager] Releasing lock on file hash cache (/home/vagrant/build/se.leap.bitmaskclient/ics-openvpn/.gradle/4.6/fileHashes).
19:10:24.488 [DEBUG] [org.apache.http.impl.conn.PoolingHttpClientConnectionManager] Connection manager is shutting down
19:10:24.488 [DEBUG] [org.apache.http.impl.conn.DefaultManagedHttpClientConnection] http-outgoing-1: Close connection
19:10:24.491 [DEBUG] [org.apache.http.impl.conn.DefaultManagedHttpClientConnection] http-outgoing-0: Close connection
19:10:24.492 [DEBUG] [org.apache.http.impl.conn.PoolingHttpClientConnectionManager] Connection manager shut down
19:10:24.493 [DEBUG] [org.apache.http.impl.conn.PoolingHttpClientConnectionManager] Connection manager is shutting down
19:10:24.493 [DEBUG] [org.apache.http.impl.conn.DefaultManagedHttpClientConnection] http-outgoing-2: Close connection
19:10:24.493 [DEBUG] [org.apache.http.impl.conn.DefaultManagedHttpClientConnection] http-outgoing-3: Close connection
19:10:24.496 [DEBUG] [org.apache.http.impl.conn.DefaultManagedHttpClientConnection] http-outgoing-4: Close connection
19:10:24.497 [DEBUG] [org.gradle.cache.internal.LockOnDemandCrossProcessCacheAccess] Releasing file lock for artifact cache (/home/vagrant/.gradle/caches/modules-2)
19:10:24.498 [DEBUG] [org.gradle.cache.internal.btree.BTreePersistentIndexedCache] Closing cache module-metadata.bin (/home/vagrant/.gradle/caches/modules-2/metadata-2.53/module-metadata.bin)
19:10:24.499 [DEBUG] [org.gradle.cache.internal.btree.BTreePersistentIndexedCache] Closing cache module-artifact.bin (/home/vagrant/.gradle/caches/modules-2/metadata-2.53/module-artifact.bin)
19:10:24.499 [DEBUG] [org.gradle.cache.internal.btree.BTreePersistentIndexedCache] Closing cache resource-at-url.bin (/home/vagrant/.gradle/caches/modules-2/metadata-2.53/resource-at-url.bin)
19:10:24.499 [DEBUG] [org.gradle.cache.internal.DefaultFileLockManager] Releasing lock on artifact cache (/home/vagrant/.gradle/caches/modules-2).
19:10:24.500 [DEBUG] [org.gradle.launcher.daemon.server.exec.ExecuteBuild] The daemon has finished executing the build.
19:10:24.782 [DEBUG] [org.gradle.launcher.daemon.client.DaemonClient] Received result Failure[value=org.gradle.initialization.ReportedException: org.gradle.internal.exceptions.LocationAwareException: Build file '/home/vagrant/build/se.leap.bitmaskclient/ics-openvpn/main/build.gradle.kts' line: 5
An exception occurred applying plugin request [id: 'com.android.application']] from daemon DaemonInfo{pid=1531, address=[48321e8f-bea1-4883-b31d-950aea09eae5 port:36747, addresses:[/0:0:0:0:0:0:0:1, /127.0.0.1]], state=Busy, lastBusy=1566760123427, context=DefaultDaemonContext[uid=be976113-55a4-4b2b-9ec3-74eb78b57108,javaHome=/usr/lib/jvm/java-8-openjdk-amd64,daemonRegistryDir=/home/vagrant/.gradle/daemon,pid=1531,idleTimeout=10800000,daemonOpts=-Xmx4096m,-Dfile.encoding=UTF-8,-Duser.country=GB,-Duser.language=en,-Duser.variant]} (build should be done).
19:10:24.783 [DEBUG] [org.gradle.launcher.daemon.client.DaemonClientConnection] thread 1: dispatching class org.gradle.launcher.daemon.protocol.Finished
19:10:24.794 [DEBUG] [org.gradle.launcher.daemon.client.DaemonClientConnection] thread 1: connection stop
Task failed. Exit value: 1.
==== detail end ====